[syncope-dev] Build failed in Jenkins: Syncope trunk (Windows) » Syncope core #39

classic Classic list List threaded Threaded
3 messages Options
Reply | Threaded
Open this post in threaded view
|

[syncope-dev] Build failed in Jenkins: Syncope trunk (Windows) » Syncope core #39

jenkins
See <http://jenkins.syncope-idm.org/job/Syncope%20trunk%20(Windows)/org.syncope$syncope-core/39/changes>

Changes:

[chicchiricco] Refactoring stuff for new workflow adapter + implementing NoOpUserWorkflowAdapter

------------------------------------------
[...truncated 97 lines...]
Downloaded: http://repo1.maven.org/maven2/org/apache/cxf/cxf-api/2.4.1/cxf-api-2.4.1.jar (351 KB at 193.4 KB/sec)
Downloading: http://repo1.maven.org/maven2/org/apache/neethi/neethi/3.0.0/neethi-3.0.0.jar
Downloaded: http://repo1.maven.org/maven2/org/apache/neethi/neethi/3.0.0/neethi-3.0.0.jar (68 KB at 122.6 KB/sec)
Downloading: http://repo1.maven.org/maven2/org/apache/cxf/cxf-rt-core/2.4.1/cxf-rt-core-2.4.1.jar
Downloaded: http://repo1.maven.org/maven2/org/apache/cxf/cxf-rt-frontend-jaxws/2.4.1/cxf-rt-frontend-jaxws-2.4.1.jar (345 KB at 92.2 KB/sec)
Downloading: http://repo1.maven.org/maven2/org/apache/cxf/cxf-rt-bindings-soap/2.4.1/cxf-rt-bindings-soap-2.4.1.jar
Downloaded: http://repo1.maven.org/maven2/org/apache/cxf/cxf-common-utilities/2.4.1/cxf-common-utilities-2.4.1.jar (318 KB at 116.3 KB/sec)
Downloading: http://repo1.maven.org/maven2/org/apache/cxf/cxf-tools-common/2.4.1/cxf-tools-common-2.4.1.jar
Downloaded: http://repo1.maven.org/maven2/org/apache/cxf/cxf-rt-bindings-soap/2.4.1/cxf-rt-bindings-soap-2.4.1.jar (170 KB at 150.6 KB/sec)
Downloading: http://repo1.maven.org/maven2/org/apache/cxf/cxf-rt-databinding-jaxb/2.4.1/cxf-rt-databinding-jaxb-2.4.1.jar
Downloaded: http://repo1.maven.org/maven2/org/apache/cxf/cxf-rt-databinding-jaxb/2.4.1/cxf-rt-databinding-jaxb-2.4.1.jar (91 KB at 144.9 KB/sec)
Downloading: http://repo1.maven.org/maven2/org/apache/cxf/cxf-rt-bindings-xml/2.4.1/cxf-rt-bindings-xml-2.4.1.jar
Downloaded: http://repo1.maven.org/maven2/org/apache/cxf/cxf-rt-core/2.4.1/cxf-rt-core-2.4.1.jar (492 KB at 174.7 KB/sec)
Downloading: http://repo1.maven.org/maven2/org/apache/cxf/cxf-rt-frontend-simple/2.4.1/cxf-rt-frontend-simple-2.4.1.jar
Downloaded: http://repo1.maven.org/maven2/org/apache/cxf/cxf-rt-bindings-xml/2.4.1/cxf-rt-bindings-xml-2.4.1.jar (37 KB at 46.8 KB/sec)
Downloading: http://repo1.maven.org/maven2/org/apache/cxf/cxf-rt-ws-addr/2.4.1/cxf-rt-ws-addr-2.4.1.jar
Downloaded: http://repo1.maven.org/maven2/net/sf/ehcache/ehcache-core/2.4.5/ehcache-core-2.4.5.jar (983 KB at 138.8 KB/sec)
Downloading: http://repo1.maven.org/maven2/org/apache/cxf/cxf-rt-transports-http/2.4.1/cxf-rt-transports-http-2.4.1.jar
Downloaded: http://repo1.maven.org/maven2/org/apache/cxf/cxf-rt-frontend-simple/2.4.1/cxf-rt-frontend-simple-2.4.1.jar (97 KB at 59.9 KB/sec)
Downloading: http://repo1.maven.org/maven2/org/apache/cxf/cxf-rt-transports-common/2.4.1/cxf-rt-transports-common-2.4.1.jar
Downloaded: http://repo1.maven.org/maven2/org/apache/cxf/cxf-tools-common/2.4.1/cxf-tools-common-2.4.1.jar (157 KB at 43.3 KB/sec)
Downloaded: http://repo1.maven.org/maven2/org/apache/cxf/cxf-rt-ws-addr/2.4.1/cxf-rt-ws-addr-2.4.1.jar (86 KB at 40.1 KB/sec)
Downloaded: http://repo1.maven.org/maven2/org/aspectj/aspectjweaver/1.6.8/aspectjweaver-1.6.8.jar (1590 KB at 158.3 KB/sec)
Downloaded: http://repo1.maven.org/maven2/org/apache/cxf/cxf-rt-transports-http/2.4.1/cxf-rt-transports-http-2.4.1.jar (201 KB at 97.0 KB/sec)
Downloaded: http://repo1.maven.org/maven2/org/apache/cxf/cxf-rt-transports-common/2.4.1/cxf-rt-transports-common-2.4.1.jar (18 KB at 11.8 KB/sec)
Downloading: http://repository.jboss.org/nexus/content/groups/public-jboss/org/activiti/activiti-engine/5.7/activiti-engine-5.7.jar
Downloading: http://repository.jboss.org/nexus/content/groups/public-jboss/org/activiti/activiti-spring/5.7/activiti-spring-5.7.jar
Downloading: http://maven.alfresco.com/nexus/content/repositories/activiti/org/activiti/activiti-engine/5.7/activiti-engine-5.7.jar
Downloading: http://maven.alfresco.com/nexus/content/repositories/activiti/org/activiti/activiti-spring/5.7/activiti-spring-5.7.jar
Downloaded: http://maven.alfresco.com/nexus/content/repositories/activiti/org/activiti/activiti-spring/5.7/activiti-spring-5.7.jar (22 KB at 36.9 KB/sec)
Downloaded: http://maven.alfresco.com/nexus/content/repositories/activiti/org/activiti/activiti-engine/5.7/activiti-engine-5.7.jar (1038 KB at 364.7 KB/sec)
[INFO]
[INFO] --- maven-clean-plugin:2.4.1:clean (default-clean) @ syncope-core ---
[INFO]
[INFO] --- maven-enforcer-plugin:1.0:enforce (enforce-maven) @ syncope-core ---
[INFO]
[INFO] --- syncope-build-tools:0.7-SNAPSHOT:set-dynamic-properties (set-dynamic-properties) @ syncope-core ---
[INFO]
[INFO] --- maven-resources-plugin:2.5:resources (default-resources) @ syncope-core ---
[debug] execute contextualize
[INFO] Using 'UTF-8' encoding to copy filtered resources.
[INFO] Copying 25 resources
[INFO]
[INFO] --- maven-compiler-plugin:2.3.2:compile (default-compile) @ syncope-core ---
[INFO] Compiling 188 source files to <http://jenkins.syncope-idm.org/job/Syncope%20trunk%20(Windows)/org.syncope$syncope-core/ws/target\classes>
[INFO]
[INFO] --- maven-resources-plugin:2.5:testResources (default-testResources) @ syncope-core ---
[debug] execute contextualize
[INFO] Using 'UTF-8' encoding to copy filtered resources.
[INFO] Copying 12 resources
[INFO]
[INFO] --- maven-dependency-plugin:2.3:copy (set-bundles) @ syncope-core ---
[INFO] Configured Artifact: org.connid.bundles.soap:org.connid.bundles.soap:1.1:jar
[INFO] Configured Artifact: org.connid.bundles.db:org.connid.bundles.db.table:1.2.1:jar
[INFO] Configured Artifact: org.connid.bundles:org.connid.bundles.csvdir:0.1:jar
[INFO] Copying org.connid.bundles.soap-1.1.jar to <http://jenkins.syncope-idm.org/job/Syncope%20trunk%20(Windows)/org.syncope$syncope-core/ws/target\bundles\org.connid.bundles.soap-1.1.jar>
[INFO] Copying org.connid.bundles.db.table-1.2.1.jar to <http://jenkins.syncope-idm.org/job/Syncope%20trunk%20(Windows)/org.syncope$syncope-core/ws/target\bundles\org.connid.bundles.db.table-1.2.1.jar>
[INFO] Copying org.connid.bundles.csvdir-0.1.jar to <http://jenkins.syncope-idm.org/job/Syncope%20trunk%20(Windows)/org.syncope$syncope-core/ws/target\bundles\org.connid.bundles.csvdir-0.1.jar>
[INFO]
[INFO] --- maven-compiler-plugin:2.3.2:testCompile (default-testCompile) @ syncope-core ---
[INFO] Compiling 40 source files to <http://jenkins.syncope-idm.org/job/Syncope%20trunk%20(Windows)/org.syncope$syncope-core/ws/target\test-classes>
[INFO]
[INFO] Tests are skipped.
[INFO] --- maven-surefire-plugin:2.9:test (default-test) @ syncope-core ---
[INFO]
[INFO] Surefire report directory: <http://jenkins.syncope-idm.org/job/Syncope%20trunk%20(Windows)/org.syncope$syncope-core/ws/target\surefire-reports>
[INFO] --- maven-surefire-plugin:2.9:test (test-phase-execution) @ syncope-core ---

-------------------------------------------------------
 T E S T S
-------------------------------------------------------
Running org.syncope.core.init.ConnInstanceLoaderTest
Tests run: 2, Failures: 0, Errors: 0, Skipped: 0, Time elapsed: 18.018 sec
Running org.syncope.core.persistence.dao.AttrTest
Tests run: 7, Failures: 0, Errors: 0, Skipped: 0, Time elapsed: 0.411 sec
Running org.syncope.core.persistence.dao.ConnInstanceTest
Tests run: 4, Failures: 0, Errors: 0, Skipped: 0, Time elapsed: 0.046 sec
Running org.syncope.core.persistence.dao.DerAttrTest
Tests run: 6, Failures: 0, Errors: 0, Skipped: 0, Time elapsed: 0.335 sec
Running org.syncope.core.persistence.dao.DerSchemaTest
Tests run: 4, Failures: 0, Errors: 0, Skipped: 0, Time elapsed: 0.046 sec
Running org.syncope.core.persistence.dao.EntitlementTest
Tests run: 4, Failures: 0, Errors: 0, Skipped: 0, Time elapsed: 0.015 sec
Running org.syncope.core.persistence.dao.MembershipTest
Tests run: 4, Failures: 0, Errors: 0, Skipped: 0, Time elapsed: 0.122 sec
Running org.syncope.core.persistence.dao.PolicyTest
Tests run: 9, Failures: 0, Errors: 0, Skipped: 0, Time elapsed: 0.153 sec
Running org.syncope.core.persistence.dao.ResourceTest
Tests run: 6, Failures: 0, Errors: 0, Skipped: 0, Time elapsed: 0.137 sec
Running org.syncope.core.persistence.dao.RoleTest
Tests run: 8, Failures: 0, Errors: 0, Skipped: 0, Time elapsed: 0.152 sec
Running org.syncope.core.persistence.dao.SchemaTest
Tests run: 7, Failures: 0, Errors: 0, Skipped: 0, Time elapsed: 0.061 sec
Running org.syncope.core.persistence.dao.TaskExecTest
Tests run: 2, Failures: 0, Errors: 0, Skipped: 0, Time elapsed: 0.015 sec
Running org.syncope.core.persistence.dao.TaskTest
Tests run: 4, Failures: 0, Errors: 0, Skipped: 0, Time elapsed: 0.442 sec
Running org.syncope.core.persistence.dao.UserSearchTest
Tests run: 7, Failures: 0, Errors: 0, Skipped: 0, Time elapsed: 0.411 sec
Running org.syncope.core.persistence.dao.UserTest
Tests run: 11, Failures: 0, Errors: 0, Skipped: 0, Time elapsed: 0.352 sec
Running org.syncope.core.persistence.dao.VirAttrTest
Tests run: 6, Failures: 0, Errors: 0, Skipped: 0, Time elapsed: 0.084 sec
Running org.syncope.core.persistence.dao.VirSchemaTest
Tests run: 4, Failures: 0, Errors: 0, Skipped: 0, Time elapsed: 0 sec
Running org.syncope.core.rest.data.ResourceDataBinderTest
Tests run: 2, Failures: 0, Errors: 0, Skipped: 0, Time elapsed: 0.017 sec

Results :

Tests run: 97, Failures: 0, Errors: 0, Skipped: 0

[JENKINS] Recording test results
[INFO]
[INFO] --- maven-surefire-plugin:2.9:test (relationship-test-execution) @ syncope-core ---
[INFO] Surefire report directory: <http://jenkins.syncope-idm.org/job/Syncope%20trunk%20(Windows)/org.syncope$syncope-core/ws/target\surefire-reports>

-------------------------------------------------------
 T E S T S
-------------------------------------------------------
Running org.syncope.core.persistence.relationships.AttrTest
Tests run: 3, Failures: 0, Errors: 0, Skipped: 0, Time elapsed: 11.014 sec
Running org.syncope.core.persistence.relationships.DerSchemaTest
Tests run: 1, Failures: 0, Errors: 0, Skipped: 0, Time elapsed: 0.055 sec
Running org.syncope.core.persistence.relationships.MembershipTest
Tests run: 2, Failures: 0, Errors: 0, Skipped: 0, Time elapsed: 0.184 sec
Running org.syncope.core.persistence.relationships.ResourceTest
Tests run: 3, Failures: 0, Errors: 0, Skipped: 0, Time elapsed: 0.442 sec
Running org.syncope.core.persistence.relationships.RoleTest
Tests run: 1, Failures: 0, Errors: 0, Skipped: 0, Time elapsed: 0.092 sec
Running org.syncope.core.persistence.relationships.SchemaTest
Tests run: 2, Failures: 0, Errors: 0, Skipped: 0, Time elapsed: 0.129 sec
Running org.syncope.core.persistence.relationships.TaskTest
Tests run: 6, Failures: 0, Errors: 0, Skipped: 0, Time elapsed: 0.461 sec
Running org.syncope.core.persistence.relationships.UserTest
Tests run: 1, Failures: 0, Errors: 0, Skipped: 0, Time elapsed: 0.11 sec

Results :

Tests run: 19, Failures: 0, Errors: 0, Skipped: 0

[JENKINS] Recording test results
[INFO]
[INFO] --- maven-war-plugin:2.1.1:war (default-war) @ syncope-core ---
[INFO] Packaging webapp
[INFO] Assembling webapp [syncope-core] in [<http://jenkins.syncope-idm.org/job/Syncope%20trunk%20(Windows)/org.syncope$syncope-core/ws/target\syncope]>
[INFO] Processing war project
[INFO] Copying webapp webResources [<http://jenkins.syncope-idm.org/job/Syncope%20trunk%20(Windows)/org.syncope$syncope-core/ws/src/main/webapp]> to [<http://jenkins.syncope-idm.org/job/Syncope%20trunk%20(Windows)/org.syncope$syncope-core/ws/target\syncope]>
[INFO] Copying webapp resources [<http://jenkins.syncope-idm.org/job/Syncope%20trunk%20(Windows)/org.syncope$syncope-core/ws/src\main\webapp]>
[INFO] Webapp assembled in [17118 msecs]
[INFO] Building war: <http://jenkins.syncope-idm.org/job/Syncope%20trunk%20(Windows)/org.syncope$syncope-core/ws/target\syncope.war>
[WARNING] Warning: selected war files include a WEB-INF/web.xml which will be ignored
(webxml attribute is missing from war task, or ignoreWebxml attribute is specified as 'true')
[INFO] Packaging classes
[INFO] Building jar: <http://jenkins.syncope-idm.org/job/Syncope%20trunk%20(Windows)/org.syncope$syncope-core/ws/target\syncope-classes.jar>
[INFO]
[INFO] --- maven-antrun-plugin:1.6:run (explodeSyncopeWAR) @ syncope-core ---
[INFO] Executing tasks

main:
    [unzip] Expanding: <http://jenkins.syncope-idm.org/job/Syncope%20trunk%20(Windows)/org.syncope$syncope-core/ws/target\syncope.war> into <http://jenkins.syncope-idm.org/job/Syncope%20trunk%20(Windows)/org.syncope$syncope-core/ws/target\syncope-core-test>
[INFO] Executed tasks
[INFO]
[INFO] --- maven-antrun-plugin:1.6:run (setupTomcat) @ syncope-core ---
[INFO] Executing tasks

main:
      [get] Getting: http://www.apache.org/dist/tomcat/tomcat-7/v7.0.22/bin/apache-tomcat-7.0.22.zip
      [get] To: C:\WINDOWS\TEMP\apache-tomcat-7.0.22.zip
    [unzip] Expanding: C:\WINDOWS\TEMP\apache-tomcat-7.0.22.zip into C:\WINDOWS\TEMP
[INFO] Executed tasks
[INFO]
[INFO] --- maven-antrun-plugin:1.6:run (setupCSV) @ syncope-core ---
[INFO] Executing tasks

main:
     [copy] Copying 1 file to C:\WINDOWS\TEMP
[INFO] Executed tasks
[INFO]
[INFO] --- maven-hsqldb-plugin:1.0:run (startTestDb) @ syncope-core ---
[Server@1bf0a0]: [Thread[pool-1-thread-1,5,main]]: setSilent(true)
[Server@1bf0a0]: Initiating startup sequence...
[Server@1bf0a0]: Server socket opened successfully in 226 ms.
[Server@1bf0a0]: Database [index=0, id=0, db=mem:testdb, alias=testdb] opened sucessfully in 442 ms.
[Server@1bf0a0]: Startup sequence completed in 668 ms.
[Server@1bf0a0]: 2011-10-03 14:20:17.144 HSQLDB server 2.2.4 is online on port 9001
[Server@1bf0a0]: To close normally, connect and execute SHUTDOWN SQL
[Server@1bf0a0]: From command line, use [Ctrl]+[C] to abort abruptly
[INFO] HSQL Launched
[INFO] ONLINE
[INFO] Live name: testdb
[INFO]
[INFO] --- sql-maven-plugin:1.4:execute (loadTestDb) @ syncope-core ---
[INFO] Executing file: C:\WINDOWS\TEMP\testdb.801702159sql
[INFO] 4 of 4 SQL statements executed successfully
[INFO]
[INFO] --- cargo-maven2-plugin:1.1.2:start (start-container) @ syncope-core ---
[INFO]
[INFO] --- maven-failsafe-plugin:2.9:integration-test (default) @ syncope-core ---
[INFO] Failsafe report directory: <http://jenkins.syncope-idm.org/job/Syncope%20trunk%20(Windows)/org.syncope$syncope-core/ws/target\failsafe-reports>

-------------------------------------------------------
 T E S T S
-------------------------------------------------------
Running org.syncope.core.rest.AuthenticationTestITCase
Tests run: 4, Failures: 0, Errors: 0, Skipped: 0, Time elapsed: 32.493 sec
Running org.syncope.core.rest.ConfigurationTestITCase
Tests run: 5, Failures: 0, Errors: 0, Skipped: 0, Time elapsed: 0.208 sec
Running org.syncope.core.rest.ConnInstanceTestITCase
Tests run: 10, Failures: 0, Errors: 1, Skipped: 0, Time elapsed: 1.227 sec <<< FAILURE!
Running org.syncope.core.rest.DerivedSchemaTestITCase
Tests run: 5, Failures: 0, Errors: 0, Skipped: 0, Time elapsed: 0.54 sec
Running org.syncope.core.rest.LogTestITCase
Tests run: 1, Failures: 0, Errors: 0, Skipped: 0, Time elapsed: 0.021 sec
Running org.syncope.core.rest.PolicyTestITCase
Tests run: 9, Failures: 0, Errors: 0, Skipped: 0, Time elapsed: 1.06 sec
Running org.syncope.core.rest.ResourceTestITCase
Tests run: 13, Failures: 0, Errors: 0, Skipped: 0, Time elapsed: 0.805 sec
Running org.syncope.core.rest.RoleTestITCase
Tests run: 10, Failures: 0, Errors: 0, Skipped: 0, Time elapsed: 0.991 sec
Running org.syncope.core.rest.SchemaTestITCase
Tests run: 4, Failures: 0, Errors: 0, Skipped: 0, Time elapsed: 0.206 sec
Running org.syncope.core.rest.TaskTestITCase
Tests run: 10, Failures: 1, Errors: 0, Skipped: 0, Time elapsed: 7.354 sec <<< FAILURE!
Running org.syncope.core.rest.UserTestITCase
Tests run: 21, Failures: 0, Errors: 2, Skipped: 0, Time elapsed: 4.915 sec <<< FAILURE!
Running org.syncope.core.rest.VirtualSchemaTestITCase
Tests run: 4, Failures: 0, Errors: 0, Skipped: 0, Time elapsed: 0.152 sec

Results :

Failed tests:   deal(org.syncope.core.rest.TaskTestITCase): expected:<[]SUBMITTED> but was:<[UN]SUBMITTED>

Tests in error:
  getSchemaNames(org.syncope.core.rest.ConnInstanceTestITCase): 500 Internal Server Error
  verifyTaskRegistration(org.syncope.core.rest.UserTestITCase): {[Propagation [ws-target-resource-2]], }
  create(org.syncope.core.rest.UserTestITCase): {[Propagation [ws-target-resource-2]], }

Tests run: 96, Failures: 1, Errors: 3, Skipped: 0

[JENKINS] Recording test results
[INFO]
[INFO] --- cargo-maven2-plugin:1.1.2:stop (stop-container) @ syncope-core ---
[INFO]
[INFO] --- maven-failsafe-plugin:2.9:verify (default) @ syncope-core ---
[INFO] Failsafe report directory: <http://jenkins.syncope-idm.org/job/Syncope%20trunk%20(Windows)/org.syncope$syncope-core/ws/target\failsafe-reports>
[JENKINS] Archiving <http://jenkins.syncope-idm.org/job/Syncope%20trunk%20(Windows)/org.syncope$syncope-core/ws/pom.xml> to /var/lib/jenkins/jobs/Syncope trunk (Windows)/modules/org.syncope$syncope-core/builds/2011-10-03_14-16-06/archive/org.syncope/syncope-core/0.7-SNAPSHOT/syncope-core-0.7-SNAPSHOT.pom
[JENKINS] Archiving <http://jenkins.syncope-idm.org/job/Syncope%20trunk%20(Windows)/org.syncope$syncope-core/ws/target\syncope.war> to /var/lib/jenkins/jobs/Syncope trunk (Windows)/modules/org.syncope$syncope-core/builds/2011-10-03_14-16-06/archive/org.syncope/syncope-core/0.7-SNAPSHOT/syncope-core-0.7-SNAPSHOT.war
[JENKINS] Archiving <http://jenkins.syncope-idm.org/job/Syncope%20trunk%20(Windows)/org.syncope$syncope-core/ws/target\syncope-classes.jar> to /var/lib/jenkins/jobs/Syncope trunk (Windows)/modules/org.syncope$syncope-core/builds/2011-10-03_14-16-06/archive/org.syncope/syncope-core/0.7-SNAPSHOT/syncope-core-0.7-SNAPSHOT-classes.jar

Reply | Threaded
Open this post in threaded view
|

[syncope-dev] Build failed in Jenkins: Syncope trunk (Windows) » Syncope core #40

jenkins
See <http://jenkins.syncope-idm.org/job/Syncope%20trunk%20(Windows)/org.syncope$syncope-core/40/>

------------------------------------------
[INFO]                                                                        
[INFO] ------------------------------------------------------------------------
[INFO] Building Syncope core 0.7-SNAPSHOT
[INFO] ------------------------------------------------------------------------
[INFO]
[INFO] --- maven-clean-plugin:2.4.1:clean (default-clean) @ syncope-core ---
[INFO]
[INFO] --- maven-enforcer-plugin:1.0:enforce (enforce-maven) @ syncope-core ---
[INFO]
[INFO] --- syncope-build-tools:0.7-SNAPSHOT:set-dynamic-properties (set-dynamic-properties) @ syncope-core ---
[INFO] [debug] execute contextualize
[INFO] Using 'UTF-8' encoding to copy filtered resources.

[INFO] --- maven-resources-plugin:2.5:resources (default-resources) @ syncope-core ---
[INFO] Copying 25 resources
[INFO]
[INFO] --- maven-compiler-plugin:2.3.2:compile (default-compile) @ syncope-core ---
[INFO] Compiling 188 source files to <http://jenkins.syncope-idm.org/job/Syncope%20trunk%20(Windows)/org.syncope$syncope-core/ws/target\classes>
[INFO]
[debug] execute contextualize
[INFO] [INFO] Using 'UTF-8' encoding to copy filtered resources.
--- maven-resources-plugin:2.5:testResources (default-testResources) @ syncope-core ---
[INFO] Copying 12 resources
[INFO]
[INFO] --- maven-dependency-plugin:2.3:copy (set-bundles) @ syncope-core ---
[INFO] Configured Artifact: org.connid.bundles.soap:org.connid.bundles.soap:1.1:jar
[INFO] Configured Artifact: org.connid.bundles.db:org.connid.bundles.db.table:1.2.1:jar
[INFO] Configured Artifact: org.connid.bundles:org.connid.bundles.csvdir:0.1:jar
[INFO] Copying org.connid.bundles.soap-1.1.jar to <http://jenkins.syncope-idm.org/job/Syncope%20trunk%20(Windows)/org.syncope$syncope-core/ws/target\bundles\org.connid.bundles.soap-1.1.jar>
[INFO] Copying org.connid.bundles.db.table-1.2.1.jar to <http://jenkins.syncope-idm.org/job/Syncope%20trunk%20(Windows)/org.syncope$syncope-core/ws/target\bundles\org.connid.bundles.db.table-1.2.1.jar>
[INFO] Copying org.connid.bundles.csvdir-0.1.jar to <http://jenkins.syncope-idm.org/job/Syncope%20trunk%20(Windows)/org.syncope$syncope-core/ws/target\bundles\org.connid.bundles.csvdir-0.1.jar>
[INFO]
[INFO] --- maven-compiler-plugin:2.3.2:testCompile (default-testCompile) @ syncope-core ---
[INFO] Compiling 40 source files to <http://jenkins.syncope-idm.org/job/Syncope%20trunk%20(Windows)/org.syncope$syncope-core/ws/target\test-classes>
[INFO]
[INFO] [INFO] Tests are skipped.
--- maven-surefire-plugin:2.9:test (default-test) @ syncope-core ---
[INFO] [INFO] Surefire report directory: <http://jenkins.syncope-idm.org/job/Syncope%20trunk%20(Windows)/org.syncope$syncope-core/ws/target\surefire-reports>

[INFO] --- maven-surefire-plugin:2.9:test (test-phase-execution) @ syncope-core ---

-------------------------------------------------------
 T E S T S
-------------------------------------------------------
Running org.syncope.core.init.ConnInstanceLoaderTest
Tests run: 2, Failures: 0, Errors: 0, Skipped: 0, Time elapsed: 21.877 sec
Running org.syncope.core.persistence.dao.AttrTest
Tests run: 7, Failures: 0, Errors: 0, Skipped: 0, Time elapsed: 0.498 sec
Running org.syncope.core.persistence.dao.ConnInstanceTest
Tests run: 4, Failures: 0, Errors: 0, Skipped: 0, Time elapsed: 0.04 sec
Running org.syncope.core.persistence.dao.DerAttrTest
Tests run: 6, Failures: 0, Errors: 0, Skipped: 0, Time elapsed: 0.157 sec
Running org.syncope.core.persistence.dao.DerSchemaTest
Tests run: 4, Failures: 0, Errors: 0, Skipped: 0, Time elapsed: 0.053 sec
Running org.syncope.core.persistence.dao.EntitlementTest
Tests run: 4, Failures: 0, Errors: 0, Skipped: 0, Time elapsed: 0.144 sec
Running org.syncope.core.persistence.dao.MembershipTest
Tests run: 4, Failures: 0, Errors: 0, Skipped: 0, Time elapsed: 0.066 sec
Running org.syncope.core.persistence.dao.PolicyTest
Tests run: 9, Failures: 0, Errors: 0, Skipped: 0, Time elapsed: 0.472 sec
Running org.syncope.core.persistence.dao.ResourceTest
Tests run: 6, Failures: 0, Errors: 0, Skipped: 0, Time elapsed: 0.131 sec
Running org.syncope.core.persistence.dao.RoleTest
Tests run: 8, Failures: 0, Errors: 0, Skipped: 0, Time elapsed: 0.183 sec
Running org.syncope.core.persistence.dao.SchemaTest
Tests run: 7, Failures: 0, Errors: 0, Skipped: 0, Time elapsed: 0.078 sec
Running org.syncope.core.persistence.dao.TaskExecTest
Tests run: 2, Failures: 0, Errors: 0, Skipped: 0, Time elapsed: 0.027 sec
Running org.syncope.core.persistence.dao.TaskTest
Tests run: 4, Failures: 0, Errors: 0, Skipped: 0, Time elapsed: 0.183 sec
Running org.syncope.core.persistence.dao.UserSearchTest
Tests run: 7, Failures: 0, Errors: 0, Skipped: 0, Time elapsed: 0.367 sec
Running org.syncope.core.persistence.dao.UserTest
Tests run: 11, Failures: 0, Errors: 0, Skipped: 0, Time elapsed: 0.367 sec
Running org.syncope.core.persistence.dao.VirAttrTest
Tests run: 6, Failures: 0, Errors: 0, Skipped: 0, Time elapsed: 0.092 sec
Running org.syncope.core.persistence.dao.VirSchemaTest
Tests run: 4, Failures: 0, Errors: 0, Skipped: 0, Time elapsed: 0.026 sec
Running org.syncope.core.rest.data.ResourceDataBinderTest
Tests run: 2, Failures: 0, Errors: 0, Skipped: 0, Time elapsed: 0.013 sec

Results :

Tests run: 97, Failures: 0, Errors: 0, Skipped: 0

[JENKINS] Recording test results
[INFO]
[INFO] --- maven-surefire-plugin:2.9:test (relationship-test-execution) @ syncope-core ---
[INFO] Surefire report directory: <http://jenkins.syncope-idm.org/job/Syncope%20trunk%20(Windows)/org.syncope$syncope-core/ws/target\surefire-reports>

-------------------------------------------------------
 T E S T S
-------------------------------------------------------
Running org.syncope.core.persistence.relationships.AttrTest
Tests run: 3, Failures: 0, Errors: 0, Skipped: 0, Time elapsed: 10.469 sec
Running org.syncope.core.persistence.relationships.DerSchemaTest
Tests run: 1, Failures: 0, Errors: 0, Skipped: 0, Time elapsed: 0.032 sec
Running org.syncope.core.persistence.relationships.MembershipTest
Tests run: 2, Failures: 0, Errors: 0, Skipped: 0, Time elapsed: 0.111 sec
Running org.syncope.core.persistence.relationships.ResourceTest
Tests run: 3, Failures: 0, Errors: 0, Skipped: 0, Time elapsed: 0.318 sec
Running org.syncope.core.persistence.relationships.RoleTest
Tests run: 1, Failures: 0, Errors: 0, Skipped: 0, Time elapsed: 0.079 sec
Running org.syncope.core.persistence.relationships.SchemaTest
Tests run: 2, Failures: 0, Errors: 0, Skipped: 0, Time elapsed: 0.143 sec
Running org.syncope.core.persistence.relationships.TaskTest
Tests run: 6, Failures: 0, Errors: 0, Skipped: 0, Time elapsed: 0.381 sec
Running org.syncope.core.persistence.relationships.UserTest
Tests run: 1, Failures: 0, Errors: 0, Skipped: 0, Time elapsed: 0 sec

Results :

Tests run: 19, Failures: 0, Errors: 0, Skipped: 0

[JENKINS] Recording test results
[INFO]
[INFO] --- maven-war-plugin:2.1.1:war (default-war) @ syncope-core ---
[INFO] Packaging webapp
[INFO] Assembling webapp [syncope-core] in [<http://jenkins.syncope-idm.org/job/Syncope%20trunk%20(Windows)/org.syncope$syncope-core/ws/target\syncope]>
[INFO] Processing war project
[INFO] Copying webapp webResources [<http://jenkins.syncope-idm.org/job/Syncope%20trunk%20(Windows)/org.syncope$syncope-core/ws/src/main/webapp]> to [<http://jenkins.syncope-idm.org/job/Syncope%20trunk%20(Windows)/org.syncope$syncope-core/ws/target\syncope]>
[INFO] Copying webapp resources [<http://jenkins.syncope-idm.org/job/Syncope%20trunk%20(Windows)/org.syncope$syncope-core/ws/src\main\webapp]>
[INFO] Webapp assembled in [11257 msecs]
[INFO] Building war: <http://jenkins.syncope-idm.org/job/Syncope%20trunk%20(Windows)/org.syncope$syncope-core/ws/target\syncope.war>
[WARNING] Warning: selected war files include a WEB-INF/web.xml which will be ignored
(webxml attribute is missing from war task, or ignoreWebxml attribute is specified as 'true')
[INFO] Packaging classes
[INFO] Building jar: <http://jenkins.syncope-idm.org/job/Syncope%20trunk%20(Windows)/org.syncope$syncope-core/ws/target\syncope-classes.jar>
[INFO]
[INFO] --- maven-antrun-plugin:1.6:run (explodeSyncopeWAR) @ syncope-core ---
[INFO] Executing tasks

main:
    [unzip] Expanding: <http://jenkins.syncope-idm.org/job/Syncope%20trunk%20(Windows)/org.syncope$syncope-core/ws/target\syncope.war> into <http://jenkins.syncope-idm.org/job/Syncope%20trunk%20(Windows)/org.syncope$syncope-core/ws/target\syncope-core-test>
[INFO] Executed tasks
[INFO]
[INFO] --- maven-antrun-plugin:1.6:run (setupTomcat) @ syncope-core ---
[INFO] Executing tasks

main:
      [get] Destination already exists (skipping): C:\WINDOWS\TEMP\apache-tomcat-7.0.22.zip
    [unzip] Expanding: C:\WINDOWS\TEMP\apache-tomcat-7.0.22.zip into C:\WINDOWS\TEMP
[INFO] Executed tasks
[INFO]
[INFO] --- maven-antrun-plugin:1.6:run (setupCSV) @ syncope-core ---
[INFO] Executing tasks

main:
     [copy] Copying 1 file to C:\WINDOWS\TEMP
[INFO] Executed tasks
[INFO]
[INFO] --- maven-hsqldb-plugin:1.0:run (startTestDb) @ syncope-core ---
[Server@144e6f7]: [Thread[pool-1-thread-1,5,main]]: setSilent(true)
[Server@144e6f7]: Initiating startup sequence...
[Server@144e6f7]: Server socket opened successfully in 218 ms.
[Server@144e6f7]: Database [index=0, id=0, db=mem:testdb, alias=testdb] opened sucessfully in 528 ms.
[Server@144e6f7]: Startup sequence completed in 762 ms.
[Server@144e6f7]: 2011-10-03 17:58:15.608 HSQLDB server 2.2.4 is online on port 9001
[Server@144e6f7]: To close normally, connect and execute SHUTDOWN SQL
[Server@144e6f7]: From command line, use [Ctrl]+[C] to abort abruptly
[INFO] HSQL Launched
[INFO] ONLINE
[INFO] Live name: testdb
[INFO]
[INFO] --- sql-maven-plugin:1.4:execute (loadTestDb) @ syncope-core ---
[INFO] Executing file: C:\WINDOWS\TEMP\testdb.1417259470sql
[INFO] 4 of 4 SQL statements executed successfully
[INFO]
[INFO] --- cargo-maven2-plugin:1.1.2:start (start-container) @ syncope-core ---
[INFO]
[INFO] --- maven-failsafe-plugin:2.9:integration-test (default) @ syncope-core ---
[INFO] Failsafe report directory: <http://jenkins.syncope-idm.org/job/Syncope%20trunk%20(Windows)/org.syncope$syncope-core/ws/target\failsafe-reports>

-------------------------------------------------------
 T E S T S
-------------------------------------------------------
Running org.syncope.core.rest.AuthenticationTestITCase
Tests run: 4, Failures: 0, Errors: 0, Skipped: 0, Time elapsed: 32.066 sec
Running org.syncope.core.rest.ConfigurationTestITCase
Tests run: 5, Failures: 0, Errors: 0, Skipped: 0, Time elapsed: 0.163 sec
Running org.syncope.core.rest.ConnInstanceTestITCase
Tests run: 10, Failures: 0, Errors: 1, Skipped: 0, Time elapsed: 0.872 sec <<< FAILURE!
Running org.syncope.core.rest.DerivedSchemaTestITCase
Tests run: 5, Failures: 0, Errors: 0, Skipped: 0, Time elapsed: 0.429 sec
Running org.syncope.core.rest.LogTestITCase
Tests run: 1, Failures: 0, Errors: 0, Skipped: 0, Time elapsed: 0.014 sec
Running org.syncope.core.rest.PolicyTestITCase
Tests run: 9, Failures: 0, Errors: 0, Skipped: 0, Time elapsed: 0.65 sec
Running org.syncope.core.rest.ResourceTestITCase
Tests run: 13, Failures: 0, Errors: 0, Skipped: 0, Time elapsed: 0.724 sec
Running org.syncope.core.rest.RoleTestITCase
Tests run: 10, Failures: 0, Errors: 0, Skipped: 0, Time elapsed: 0.902 sec
Running org.syncope.core.rest.SchemaTestITCase
Tests run: 4, Failures: 0, Errors: 0, Skipped: 0, Time elapsed: 0.295 sec
Running org.syncope.core.rest.TaskTestITCase
Tests run: 10, Failures: 1, Errors: 0, Skipped: 0, Time elapsed: 5.815 sec <<< FAILURE!
Running org.syncope.core.rest.UserTestITCase
Tests run: 21, Failures: 0, Errors: 2, Skipped: 0, Time elapsed: 4.231 sec <<< FAILURE!
Running org.syncope.core.rest.VirtualSchemaTestITCase
Tests run: 4, Failures: 0, Errors: 0, Skipped: 0, Time elapsed: 0.213 sec

Results :

Failed tests:   deal(org.syncope.core.rest.TaskTestITCase): expected:<[]SUBMITTED> but was:<[UN]SUBMITTED>

Tests in error:
  getSchemaNames(org.syncope.core.rest.ConnInstanceTestITCase): 500 Internal Server Error
  verifyTaskRegistration(org.syncope.core.rest.UserTestITCase): {[Propagation [ws-target-resource-2]], }
  create(org.syncope.core.rest.UserTestITCase): {[Propagation [ws-target-resource-2]], }

Tests run: 96, Failures: 1, Errors: 3, Skipped: 0

[JENKINS] Recording test results
[INFO]
[INFO] --- cargo-maven2-plugin:1.1.2:stop (stop-container) @ syncope-core ---
[INFO] Failsafe report directory: <http://jenkins.syncope-idm.org/job/Syncope%20trunk%20(Windows)/org.syncope$syncope-core/ws/target\failsafe-reports>
[INFO]
[INFO] --- maven-failsafe-plugin:2.9:verify (default) @ syncope-core ---
[JENKINS] Archiving <http://jenkins.syncope-idm.org/job/Syncope%20trunk%20(Windows)/org.syncope$syncope-core/ws/pom.xml> to /var/lib/jenkins/jobs/Syncope trunk (Windows)/modules/org.syncope$syncope-core/builds/2011-10-03_17-53-23/archive/org.syncope/syncope-core/0.7-SNAPSHOT/syncope-core-0.7-SNAPSHOT.pom
[JENKINS] Archiving <http://jenkins.syncope-idm.org/job/Syncope%20trunk%20(Windows)/org.syncope$syncope-core/ws/target\syncope.war> to /var/lib/jenkins/jobs/Syncope trunk (Windows)/modules/org.syncope$syncope-core/builds/2011-10-03_17-53-23/archive/org.syncope/syncope-core/0.7-SNAPSHOT/syncope-core-0.7-SNAPSHOT.war
[JENKINS] Archiving <http://jenkins.syncope-idm.org/job/Syncope%20trunk%20(Windows)/org.syncope$syncope-core/ws/target\syncope-classes.jar> to /var/lib/jenkins/jobs/Syncope trunk (Windows)/modules/org.syncope$syncope-core/builds/2011-10-03_17-53-23/archive/org.syncope/syncope-core/0.7-SNAPSHOT/syncope-core-0.7-SNAPSHOT-classes.jar

Reply | Threaded
Open this post in threaded view
|

[syncope-dev] Jenkins build is back to normal : Syncope trunk (Windows) » Syncope core #41

jenkins