[syncope-dev] Build failed in Jenkins: Syncope trunk (Windows) #39

classic Classic list List threaded Threaded
3 messages Options
Reply | Threaded
Open this post in threaded view
|

[syncope-dev] Build failed in Jenkins: Syncope trunk (Windows) #39

jenkins
See <http://jenkins.syncope-idm.org/job/Syncope%20trunk%20(Windows)/39/changes>

Changes:

[chicchiricco] Refactoring stuff for new workflow adapter + implementing NoOpUserWorkflowAdapter

------------------------------------------
[...truncated 1095 lines...]
Tests run: 4, Failures: 0, Errors: 0, Skipped: 0, Time elapsed: 0.046 sec
Running org.syncope.core.persistence.dao.DerAttrTest
Tests run: 6, Failures: 0, Errors: 0, Skipped: 0, Time elapsed: 0.335 sec
Running org.syncope.core.persistence.dao.DerSchemaTest
Tests run: 4, Failures: 0, Errors: 0, Skipped: 0, Time elapsed: 0.046 sec
Running org.syncope.core.persistence.dao.EntitlementTest
Tests run: 4, Failures: 0, Errors: 0, Skipped: 0, Time elapsed: 0.015 sec
Running org.syncope.core.persistence.dao.MembershipTest
Tests run: 4, Failures: 0, Errors: 0, Skipped: 0, Time elapsed: 0.122 sec
Running org.syncope.core.persistence.dao.PolicyTest
Tests run: 9, Failures: 0, Errors: 0, Skipped: 0, Time elapsed: 0.153 sec
Running org.syncope.core.persistence.dao.ResourceTest
Tests run: 6, Failures: 0, Errors: 0, Skipped: 0, Time elapsed: 0.137 sec
Running org.syncope.core.persistence.dao.RoleTest
Tests run: 8, Failures: 0, Errors: 0, Skipped: 0, Time elapsed: 0.152 sec
Running org.syncope.core.persistence.dao.SchemaTest
Tests run: 7, Failures: 0, Errors: 0, Skipped: 0, Time elapsed: 0.061 sec
Running org.syncope.core.persistence.dao.TaskExecTest
Tests run: 2, Failures: 0, Errors: 0, Skipped: 0, Time elapsed: 0.015 sec
Running org.syncope.core.persistence.dao.TaskTest
Tests run: 4, Failures: 0, Errors: 0, Skipped: 0, Time elapsed: 0.442 sec
Running org.syncope.core.persistence.dao.UserSearchTest
Tests run: 7, Failures: 0, Errors: 0, Skipped: 0, Time elapsed: 0.411 sec
Running org.syncope.core.persistence.dao.UserTest
Tests run: 11, Failures: 0, Errors: 0, Skipped: 0, Time elapsed: 0.352 sec
Running org.syncope.core.persistence.dao.VirAttrTest
Tests run: 6, Failures: 0, Errors: 0, Skipped: 0, Time elapsed: 0.084 sec
Running org.syncope.core.persistence.dao.VirSchemaTest
Tests run: 4, Failures: 0, Errors: 0, Skipped: 0, Time elapsed: 0 sec
Running org.syncope.core.rest.data.ResourceDataBinderTest
Tests run: 2, Failures: 0, Errors: 0, Skipped: 0, Time elapsed: 0.017 sec

Results :

Tests run: 97, Failures: 0, Errors: 0, Skipped: 0

[JENKINS] Recording test results
[INFO]
[INFO] --- maven-surefire-plugin:2.9:test (relationship-test-execution) @ syncope-core ---
[INFO] Surefire report directory: <http://jenkins.syncope-idm.org/job/Syncope%20trunk%20(Windows)/ws/core\target\surefire-reports>

-------------------------------------------------------
 T E S T S
-------------------------------------------------------
Running org.syncope.core.persistence.relationships.AttrTest
Tests run: 3, Failures: 0, Errors: 0, Skipped: 0, Time elapsed: 11.014 sec
Running org.syncope.core.persistence.relationships.DerSchemaTest
Tests run: 1, Failures: 0, Errors: 0, Skipped: 0, Time elapsed: 0.055 sec
Running org.syncope.core.persistence.relationships.MembershipTest
Tests run: 2, Failures: 0, Errors: 0, Skipped: 0, Time elapsed: 0.184 sec
Running org.syncope.core.persistence.relationships.ResourceTest
Tests run: 3, Failures: 0, Errors: 0, Skipped: 0, Time elapsed: 0.442 sec
Running org.syncope.core.persistence.relationships.RoleTest
Tests run: 1, Failures: 0, Errors: 0, Skipped: 0, Time elapsed: 0.092 sec
Running org.syncope.core.persistence.relationships.SchemaTest
Tests run: 2, Failures: 0, Errors: 0, Skipped: 0, Time elapsed: 0.129 sec
Running org.syncope.core.persistence.relationships.TaskTest
Tests run: 6, Failures: 0, Errors: 0, Skipped: 0, Time elapsed: 0.461 sec
Running org.syncope.core.persistence.relationships.UserTest
Tests run: 1, Failures: 0, Errors: 0, Skipped: 0, Time elapsed: 0.11 sec

Results :

Tests run: 19, Failures: 0, Errors: 0, Skipped: 0

[JENKINS] Recording test results
[INFO]
[INFO] --- maven-war-plugin:2.1.1:war (default-war) @ syncope-core ---
[INFO] Packaging webapp
[INFO] Assembling webapp [syncope-core] in [<http://jenkins.syncope-idm.org/job/Syncope%20trunk%20(Windows)/ws/core\target\syncope]>
[INFO] Processing war project
[INFO] Copying webapp webResources [<http://jenkins.syncope-idm.org/job/Syncope%20trunk%20(Windows)/ws/core\src/main/webapp]> to [<http://jenkins.syncope-idm.org/job/Syncope%20trunk%20(Windows)/ws/core\target\syncope]>
[INFO] Copying webapp resources [<http://jenkins.syncope-idm.org/job/Syncope%20trunk%20(Windows)/ws/core\src\main\webapp]>
[INFO] Webapp assembled in [17118 msecs]
[INFO] Building war: <http://jenkins.syncope-idm.org/job/Syncope%20trunk%20(Windows)/ws/core\target\syncope.war>
[WARNING] Warning: selected war files include a WEB-INF/web.xml which will be ignored
(webxml attribute is missing from war task, or ignoreWebxml attribute is specified as 'true')
[INFO] Packaging classes
[INFO] Building jar: <http://jenkins.syncope-idm.org/job/Syncope%20trunk%20(Windows)/ws/core\target\syncope-classes.jar>
[INFO]
[INFO] --- maven-antrun-plugin:1.6:run (explodeSyncopeWAR) @ syncope-core ---
[INFO] Executing tasks

main:
    [unzip] Expanding: <http://jenkins.syncope-idm.org/job/Syncope%20trunk%20(Windows)/ws/core\target\syncope.war> into <http://jenkins.syncope-idm.org/job/Syncope%20trunk%20(Windows)/ws/core\target\syncope-core-test>
[INFO] Executed tasks
[INFO]
[INFO] --- maven-antrun-plugin:1.6:run (setupTomcat) @ syncope-core ---
[INFO] Executing tasks

main:
      [get] Getting: http://www.apache.org/dist/tomcat/tomcat-7/v7.0.22/bin/apache-tomcat-7.0.22.zip
      [get] To: C:\WINDOWS\TEMP\apache-tomcat-7.0.22.zip
    [unzip] Expanding: C:\WINDOWS\TEMP\apache-tomcat-7.0.22.zip into C:\WINDOWS\TEMP
[INFO] Executed tasks
[INFO]
[INFO] --- maven-antrun-plugin:1.6:run (setupCSV) @ syncope-core ---
[INFO] Executing tasks

main:
     [copy] Copying 1 file to C:\WINDOWS\TEMP
[INFO] Executed tasks
[INFO]
[INFO] --- maven-hsqldb-plugin:1.0:run (startTestDb) @ syncope-core ---
[Server@1bf0a0]: [Thread[pool-1-thread-1,5,main]]: setSilent(true)
[Server@1bf0a0]: Initiating startup sequence...
[Server@1bf0a0]: Server socket opened successfully in 226 ms.
[Server@1bf0a0]: Database [index=0, id=0, db=mem:testdb, alias=testdb] opened sucessfully in 442 ms.
[Server@1bf0a0]: Startup sequence completed in 668 ms.
[Server@1bf0a0]: 2011-10-03 14:20:17.144 HSQLDB server 2.2.4 is online on port 9001
[Server@1bf0a0]: To close normally, connect and execute SHUTDOWN SQL
[Server@1bf0a0]: From command line, use [Ctrl]+[C] to abort abruptly
[INFO] HSQL Launched
[INFO] ONLINE
[INFO] Live name: testdb
[INFO]
[INFO] --- sql-maven-plugin:1.4:execute (loadTestDb) @ syncope-core ---
[INFO] Executing file: C:\WINDOWS\TEMP\testdb.801702159sql
[INFO] 4 of 4 SQL statements executed successfully
[INFO]
[INFO] --- cargo-maven2-plugin:1.1.2:start (start-container) @ syncope-core ---
[INFO]
[INFO] --- maven-failsafe-plugin:2.9:integration-test (default) @ syncope-core ---
[INFO] Failsafe report directory: <http://jenkins.syncope-idm.org/job/Syncope%20trunk%20(Windows)/ws/core\target\failsafe-reports>

-------------------------------------------------------
 T E S T S
-------------------------------------------------------
Running org.syncope.core.rest.AuthenticationTestITCase
Tests run: 4, Failures: 0, Errors: 0, Skipped: 0, Time elapsed: 32.493 sec
Running org.syncope.core.rest.ConfigurationTestITCase
Tests run: 5, Failures: 0, Errors: 0, Skipped: 0, Time elapsed: 0.208 sec
Running org.syncope.core.rest.ConnInstanceTestITCase
Tests run: 10, Failures: 0, Errors: 1, Skipped: 0, Time elapsed: 1.227 sec <<< FAILURE!
Running org.syncope.core.rest.DerivedSchemaTestITCase
Tests run: 5, Failures: 0, Errors: 0, Skipped: 0, Time elapsed: 0.54 sec
Running org.syncope.core.rest.LogTestITCase
Tests run: 1, Failures: 0, Errors: 0, Skipped: 0, Time elapsed: 0.021 sec
Running org.syncope.core.rest.PolicyTestITCase
Tests run: 9, Failures: 0, Errors: 0, Skipped: 0, Time elapsed: 1.06 sec
Running org.syncope.core.rest.ResourceTestITCase
Tests run: 13, Failures: 0, Errors: 0, Skipped: 0, Time elapsed: 0.805 sec
Running org.syncope.core.rest.RoleTestITCase
Tests run: 10, Failures: 0, Errors: 0, Skipped: 0, Time elapsed: 0.991 sec
Running org.syncope.core.rest.SchemaTestITCase
Tests run: 4, Failures: 0, Errors: 0, Skipped: 0, Time elapsed: 0.206 sec
Running org.syncope.core.rest.TaskTestITCase
Tests run: 10, Failures: 1, Errors: 0, Skipped: 0, Time elapsed: 7.354 sec <<< FAILURE!
Running org.syncope.core.rest.UserTestITCase
Tests run: 21, Failures: 0, Errors: 2, Skipped: 0, Time elapsed: 4.915 sec <<< FAILURE!
Running org.syncope.core.rest.VirtualSchemaTestITCase
Tests run: 4, Failures: 0, Errors: 0, Skipped: 0, Time elapsed: 0.152 sec

Results :

Failed tests:   deal(org.syncope.core.rest.TaskTestITCase): expected:<[]SUBMITTED> but was:<[UN]SUBMITTED>

Tests in error:
  getSchemaNames(org.syncope.core.rest.ConnInstanceTestITCase): 500 Internal Server Error
  verifyTaskRegistration(org.syncope.core.rest.UserTestITCase): {[Propagation [ws-target-resource-2]], }
  create(org.syncope.core.rest.UserTestITCase): {[Propagation [ws-target-resource-2]], }

Tests run: 96, Failures: 1, Errors: 3, Skipped: 0

[JENKINS] Recording test results
[INFO]
[INFO] --- cargo-maven2-plugin:1.1.2:stop (stop-container) @ syncope-core ---
[INFO]
[INFO] --- maven-failsafe-plugin:2.9:verify (default) @ syncope-core ---
[INFO] Failsafe report directory: <http://jenkins.syncope-idm.org/job/Syncope%20trunk%20(Windows)/ws/core\target\failsafe-reports>
[JENKINS] Archiving <http://jenkins.syncope-idm.org/job/Syncope%20trunk%20(Windows)/ws/core\pom.xml> to /var/lib/jenkins/jobs/Syncope trunk (Windows)/modules/org.syncope$syncope-core/builds/2011-10-03_14-16-06/archive/org.syncope/syncope-core/0.7-SNAPSHOT/syncope-core-0.7-SNAPSHOT.pom
[JENKINS] Archiving <http://jenkins.syncope-idm.org/job/Syncope%20trunk%20(Windows)/ws/core\target\syncope.war> to /var/lib/jenkins/jobs/Syncope trunk (Windows)/modules/org.syncope$syncope-core/builds/2011-10-03_14-16-06/archive/org.syncope/syncope-core/0.7-SNAPSHOT/syncope-core-0.7-SNAPSHOT.war
[JENKINS] Archiving <http://jenkins.syncope-idm.org/job/Syncope%20trunk%20(Windows)/ws/core\target\syncope-classes.jar> to /var/lib/jenkins/jobs/Syncope trunk (Windows)/modules/org.syncope$syncope-core/builds/2011-10-03_14-16-06/archive/org.syncope/syncope-core/0.7-SNAPSHOT/syncope-core-0.7-SNAPSHOT-classes.jar
[INFO] ------------------------------------------------------------------------
[INFO] Reactor Summary:
[INFO]
[INFO] Syncope ........................................... SUCCESS [3.604s]
[INFO] Syncope build tools ............................... SUCCESS [8.951s]
[INFO] Syncope client .................................... SUCCESS [11.422s]
[INFO] Syncope core ...................................... FAILURE [5:02.184s]
[INFO] Syncope console ................................... SKIPPED
[INFO] Syncope archetype ................................. SKIPPED
[INFO] ------------------------------------------------------------------------
[INFO] BUILD FAILURE
[INFO] ------------------------------------------------------------------------
[INFO] Total time: 5:36.131s
[INFO] Finished at: Mon Oct 03 14:22:36 CEST 2011
[INFO] Final Memory: 40M/495M
[INFO] ------------------------------------------------------------------------
mavenExecutionResult exceptions not empty
message : Failed to execute goal org.apache.maven.plugins:maven-failsafe-plugin:2.9:verify (default) on project syncope-core: There are test failures.

Please refer to <http://jenkins.syncope-idm.org/job/Syncope%20trunk%20(Windows)/ws/core\target\failsafe-reports> for the individual test results.
cause : There are test failures.

Please refer to <http://jenkins.syncope-idm.org/job/Syncope%20trunk%20(Windows)/ws/core\target\failsafe-reports> for the individual test results.
Stack trace :
org.apache.maven.lifecycle.LifecycleExecutionException: Failed to execute goal org.apache.maven.plugins:maven-failsafe-plugin:2.9:verify (default) on project syncope-core: There are test failures.

Please refer to <http://jenkins.syncope-idm.org/job/Syncope%20trunk%20(Windows)/ws/core\target\failsafe-reports> for the individual test results.
        at org.apache.maven.lifecycle.internal.MojoExecutor.execute(MojoExecutor.java:213)
        at org.apache.maven.lifecycle.internal.MojoExecutor.execute(MojoExecutor.java:153)
        at org.apache.maven.lifecycle.internal.MojoExecutor.execute(MojoExecutor.java:145)
        at org.apache.maven.lifecycle.internal.LifecycleModuleBuilder.buildProject(LifecycleModuleBuilder.java:84)
        at org.apache.maven.lifecycle.internal.LifecycleModuleBuilder.buildProject(LifecycleModuleBuilder.java:59)
        at org.apache.maven.lifecycle.internal.LifecycleStarter.singleThreadedBuild(LifecycleStarter.java:183)
        at org.apache.maven.lifecycle.internal.LifecycleStarter.execute(LifecycleStarter.java:161)
        at org.apache.maven.DefaultMaven.doExecute(DefaultMaven.java:319)
        at org.apache.maven.DefaultMaven.execute(DefaultMaven.java:156)
        at org.jvnet.hudson.maven3.launcher.Maven3Launcher.main(Maven3Launcher.java:79)
        at sun.reflect.NativeMethodAccessorImpl.invoke0(Native Method)
        at sun.reflect.NativeMethodAccessorImpl.invoke(NativeMethodAccessorImpl.java:39)
        at sun.reflect.DelegatingMethodAccessorImpl.invoke(DelegatingMethodAccessorImpl.java:25)
        at java.lang.reflect.Method.invoke(Method.java:597)
        at org.codehaus.plexus.classworlds.launcher.Launcher.launchStandard(Launcher.java:329)
        at org.codehaus.plexus.classworlds.launcher.Launcher.launch(Launcher.java:239)
        at org.jvnet.hudson.maven3.agent.Maven3Main.launch(Maven3Main.java:158)
        at hudson.maven.Maven3Builder.call(Maven3Builder.java:122)
        at hudson.maven.Maven3Builder.call(Maven3Builder.java:74)
        at hudson.remoting.UserRequest.perform(UserRequest.java:118)
        at hudson.remoting.UserRequest.perform(UserRequest.java:48)
        at hudson.remoting.Request$2.run(Request.java:287)
        at java.util.concurrent.Executors$RunnableAdapter.call(Executors.java:441)
        at java.util.concurrent.FutureTask$Sync.innerRun(FutureTask.java:303)
        at java.util.concurrent.FutureTask.run(FutureTask.java:138)
        at java.util.concurrent.ThreadPoolExecutor$Worker.runTask(ThreadPoolExecutor.java:886)
        at java.util.concurrent.ThreadPoolExecutor$Worker.run(ThreadPoolExecutor.java:908)
        at java.lang.Thread.run(Thread.java:662)
Caused by: org.apache.maven.plugin.MojoFailureException: There are test failures.

Please refer to <http://jenkins.syncope-idm.org/job/Syncope%20trunk%20(Windows)/ws/core\target\failsafe-reports> for the individual test results.
        at org.apache.maven.plugin.surefire.SurefireHelper.reportExecution(SurefireHelper.java:126)
        at org.apache.maven.plugin.failsafe.VerifyMojo.execute(VerifyMojo.java:208)
        at org.apache.maven.plugin.DefaultBuildPluginManager.executeMojo(DefaultBuildPluginManager.java:101)
        at org.apache.maven.lifecycle.internal.MojoExecutor.execute(MojoExecutor.java:209)
        ... 27 more
Maven failed with error.
Sending e-mails to: [hidden email]
3-ott-2011 14.22.38 hudson.remoting.Channel$ReaderThread run
GRAVE: I/O error in channel channel
java.io.InvalidClassException: hudson.remoting.Channel$CloseCommand; local class incompatible: stream classdesc serialVersionUID = -6592593588803945669, local class serialVersionUID = 972857271608138115
        at java.io.ObjectStreamClass.initNonProxy(ObjectStreamClass.java:562)
        at java.io.ObjectInputStream.readNonProxyDesc(ObjectInputStream.java:1582)
        at java.io.ObjectInputStream.readClassDesc(ObjectInputStream.java:1495)
        at java.io.ObjectInputStream.readOrdinaryObject(ObjectInputStream.java:1731)
        at java.io.ObjectInputStream.readObject0(ObjectInputStream.java:1328)
        at java.io.ObjectInputStream.readObject(ObjectInputStream.java:350)
        at hudson.remoting.Channel$ReaderThread.run(Channel.java:1087)
channel stopped

Reply | Threaded
Open this post in threaded view
|

[syncope-dev] Build failed in Jenkins: Syncope trunk (Windows) #40

jenkins
See <http://jenkins.syncope-idm.org/job/Syncope%20trunk%20(Windows)/40/>

------------------------------------------
[...truncated 971 lines...]
Running org.syncope.core.persistence.dao.ConnInstanceTest
Tests run: 4, Failures: 0, Errors: 0, Skipped: 0, Time elapsed: 0.04 sec
Running org.syncope.core.persistence.dao.DerAttrTest
Tests run: 6, Failures: 0, Errors: 0, Skipped: 0, Time elapsed: 0.157 sec
Running org.syncope.core.persistence.dao.DerSchemaTest
Tests run: 4, Failures: 0, Errors: 0, Skipped: 0, Time elapsed: 0.053 sec
Running org.syncope.core.persistence.dao.EntitlementTest
Tests run: 4, Failures: 0, Errors: 0, Skipped: 0, Time elapsed: 0.144 sec
Running org.syncope.core.persistence.dao.MembershipTest
Tests run: 4, Failures: 0, Errors: 0, Skipped: 0, Time elapsed: 0.066 sec
Running org.syncope.core.persistence.dao.PolicyTest
Tests run: 9, Failures: 0, Errors: 0, Skipped: 0, Time elapsed: 0.472 sec
Running org.syncope.core.persistence.dao.ResourceTest
Tests run: 6, Failures: 0, Errors: 0, Skipped: 0, Time elapsed: 0.131 sec
Running org.syncope.core.persistence.dao.RoleTest
Tests run: 8, Failures: 0, Errors: 0, Skipped: 0, Time elapsed: 0.183 sec
Running org.syncope.core.persistence.dao.SchemaTest
Tests run: 7, Failures: 0, Errors: 0, Skipped: 0, Time elapsed: 0.078 sec
Running org.syncope.core.persistence.dao.TaskExecTest
Tests run: 2, Failures: 0, Errors: 0, Skipped: 0, Time elapsed: 0.027 sec
Running org.syncope.core.persistence.dao.TaskTest
Tests run: 4, Failures: 0, Errors: 0, Skipped: 0, Time elapsed: 0.183 sec
Running org.syncope.core.persistence.dao.UserSearchTest
Tests run: 7, Failures: 0, Errors: 0, Skipped: 0, Time elapsed: 0.367 sec
Running org.syncope.core.persistence.dao.UserTest
Tests run: 11, Failures: 0, Errors: 0, Skipped: 0, Time elapsed: 0.367 sec
Running org.syncope.core.persistence.dao.VirAttrTest
Tests run: 6, Failures: 0, Errors: 0, Skipped: 0, Time elapsed: 0.092 sec
Running org.syncope.core.persistence.dao.VirSchemaTest
Tests run: 4, Failures: 0, Errors: 0, Skipped: 0, Time elapsed: 0.026 sec
Running org.syncope.core.rest.data.ResourceDataBinderTest
Tests run: 2, Failures: 0, Errors: 0, Skipped: 0, Time elapsed: 0.013 sec

Results :

Tests run: 97, Failures: 0, Errors: 0, Skipped: 0

[JENKINS] Recording test results
[INFO]
[INFO] --- maven-surefire-plugin:2.9:test (relationship-test-execution) @ syncope-core ---
[INFO] Surefire report directory: <http://jenkins.syncope-idm.org/job/Syncope%20trunk%20(Windows)/ws/core\target\surefire-reports>

-------------------------------------------------------
 T E S T S
-------------------------------------------------------
Running org.syncope.core.persistence.relationships.AttrTest
Tests run: 3, Failures: 0, Errors: 0, Skipped: 0, Time elapsed: 10.469 sec
Running org.syncope.core.persistence.relationships.DerSchemaTest
Tests run: 1, Failures: 0, Errors: 0, Skipped: 0, Time elapsed: 0.032 sec
Running org.syncope.core.persistence.relationships.MembershipTest
Tests run: 2, Failures: 0, Errors: 0, Skipped: 0, Time elapsed: 0.111 sec
Running org.syncope.core.persistence.relationships.ResourceTest
Tests run: 3, Failures: 0, Errors: 0, Skipped: 0, Time elapsed: 0.318 sec
Running org.syncope.core.persistence.relationships.RoleTest
Tests run: 1, Failures: 0, Errors: 0, Skipped: 0, Time elapsed: 0.079 sec
Running org.syncope.core.persistence.relationships.SchemaTest
Tests run: 2, Failures: 0, Errors: 0, Skipped: 0, Time elapsed: 0.143 sec
Running org.syncope.core.persistence.relationships.TaskTest
Tests run: 6, Failures: 0, Errors: 0, Skipped: 0, Time elapsed: 0.381 sec
Running org.syncope.core.persistence.relationships.UserTest
Tests run: 1, Failures: 0, Errors: 0, Skipped: 0, Time elapsed: 0 sec

Results :

Tests run: 19, Failures: 0, Errors: 0, Skipped: 0

[JENKINS] Recording test results
[INFO]
[INFO] --- maven-war-plugin:2.1.1:war (default-war) @ syncope-core ---
[INFO] Packaging webapp
[INFO] Assembling webapp [syncope-core] in [<http://jenkins.syncope-idm.org/job/Syncope%20trunk%20(Windows)/ws/core\target\syncope]>
[INFO] Processing war project
[INFO] Copying webapp webResources [<http://jenkins.syncope-idm.org/job/Syncope%20trunk%20(Windows)/ws/core\src/main/webapp]> to [<http://jenkins.syncope-idm.org/job/Syncope%20trunk%20(Windows)/ws/core\target\syncope]>
[INFO] Copying webapp resources [<http://jenkins.syncope-idm.org/job/Syncope%20trunk%20(Windows)/ws/core\src\main\webapp]>
[INFO] Webapp assembled in [11257 msecs]
[INFO] Building war: <http://jenkins.syncope-idm.org/job/Syncope%20trunk%20(Windows)/ws/core\target\syncope.war>
[WARNING] Warning: selected war files include a WEB-INF/web.xml which will be ignored
(webxml attribute is missing from war task, or ignoreWebxml attribute is specified as 'true')
[INFO] Packaging classes
[INFO] Building jar: <http://jenkins.syncope-idm.org/job/Syncope%20trunk%20(Windows)/ws/core\target\syncope-classes.jar>
[INFO]
[INFO] --- maven-antrun-plugin:1.6:run (explodeSyncopeWAR) @ syncope-core ---
[INFO] Executing tasks

main:
    [unzip] Expanding: <http://jenkins.syncope-idm.org/job/Syncope%20trunk%20(Windows)/ws/core\target\syncope.war> into <http://jenkins.syncope-idm.org/job/Syncope%20trunk%20(Windows)/ws/core\target\syncope-core-test>
[INFO] Executed tasks
[INFO]
[INFO] --- maven-antrun-plugin:1.6:run (setupTomcat) @ syncope-core ---
[INFO] Executing tasks

main:
      [get] Destination already exists (skipping): C:\WINDOWS\TEMP\apache-tomcat-7.0.22.zip
    [unzip] Expanding: C:\WINDOWS\TEMP\apache-tomcat-7.0.22.zip into C:\WINDOWS\TEMP
[INFO] Executed tasks
[INFO]
[INFO] --- maven-antrun-plugin:1.6:run (setupCSV) @ syncope-core ---
[INFO] Executing tasks

main:
     [copy] Copying 1 file to C:\WINDOWS\TEMP
[INFO] Executed tasks
[INFO]
[INFO] --- maven-hsqldb-plugin:1.0:run (startTestDb) @ syncope-core ---
[Server@144e6f7]: [Thread[pool-1-thread-1,5,main]]: setSilent(true)
[Server@144e6f7]: Initiating startup sequence...
[Server@144e6f7]: Server socket opened successfully in 218 ms.
[Server@144e6f7]: Database [index=0, id=0, db=mem:testdb, alias=testdb] opened sucessfully in 528 ms.
[Server@144e6f7]: Startup sequence completed in 762 ms.
[Server@144e6f7]: 2011-10-03 17:58:15.608 HSQLDB server 2.2.4 is online on port 9001
[Server@144e6f7]: To close normally, connect and execute SHUTDOWN SQL
[Server@144e6f7]: From command line, use [Ctrl]+[C] to abort abruptly
[INFO] HSQL Launched
[INFO] ONLINE
[INFO] Live name: testdb
[INFO]
[INFO] --- sql-maven-plugin:1.4:execute (loadTestDb) @ syncope-core ---
[INFO] Executing file: C:\WINDOWS\TEMP\testdb.1417259470sql
[INFO] 4 of 4 SQL statements executed successfully
[INFO]
[INFO] --- cargo-maven2-plugin:1.1.2:start (start-container) @ syncope-core ---
[INFO]
[INFO] --- maven-failsafe-plugin:2.9:integration-test (default) @ syncope-core ---
[INFO] Failsafe report directory: <http://jenkins.syncope-idm.org/job/Syncope%20trunk%20(Windows)/ws/core\target\failsafe-reports>

-------------------------------------------------------
 T E S T S
-------------------------------------------------------
Running org.syncope.core.rest.AuthenticationTestITCase
Tests run: 4, Failures: 0, Errors: 0, Skipped: 0, Time elapsed: 32.066 sec
Running org.syncope.core.rest.ConfigurationTestITCase
Tests run: 5, Failures: 0, Errors: 0, Skipped: 0, Time elapsed: 0.163 sec
Running org.syncope.core.rest.ConnInstanceTestITCase
Tests run: 10, Failures: 0, Errors: 1, Skipped: 0, Time elapsed: 0.872 sec <<< FAILURE!
Running org.syncope.core.rest.DerivedSchemaTestITCase
Tests run: 5, Failures: 0, Errors: 0, Skipped: 0, Time elapsed: 0.429 sec
Running org.syncope.core.rest.LogTestITCase
Tests run: 1, Failures: 0, Errors: 0, Skipped: 0, Time elapsed: 0.014 sec
Running org.syncope.core.rest.PolicyTestITCase
Tests run: 9, Failures: 0, Errors: 0, Skipped: 0, Time elapsed: 0.65 sec
Running org.syncope.core.rest.ResourceTestITCase
Tests run: 13, Failures: 0, Errors: 0, Skipped: 0, Time elapsed: 0.724 sec
Running org.syncope.core.rest.RoleTestITCase
Tests run: 10, Failures: 0, Errors: 0, Skipped: 0, Time elapsed: 0.902 sec
Running org.syncope.core.rest.SchemaTestITCase
Tests run: 4, Failures: 0, Errors: 0, Skipped: 0, Time elapsed: 0.295 sec
Running org.syncope.core.rest.TaskTestITCase
Tests run: 10, Failures: 1, Errors: 0, Skipped: 0, Time elapsed: 5.815 sec <<< FAILURE!
Running org.syncope.core.rest.UserTestITCase
Tests run: 21, Failures: 0, Errors: 2, Skipped: 0, Time elapsed: 4.231 sec <<< FAILURE!
Running org.syncope.core.rest.VirtualSchemaTestITCase
Tests run: 4, Failures: 0, Errors: 0, Skipped: 0, Time elapsed: 0.213 sec

Results :

Failed tests:   deal(org.syncope.core.rest.TaskTestITCase): expected:<[]SUBMITTED> but was:<[UN]SUBMITTED>

Tests in error:
  getSchemaNames(org.syncope.core.rest.ConnInstanceTestITCase): 500 Internal Server Error
  verifyTaskRegistration(org.syncope.core.rest.UserTestITCase): {[Propagation [ws-target-resource-2]], }
  create(org.syncope.core.rest.UserTestITCase): {[Propagation [ws-target-resource-2]], }

Tests run: 96, Failures: 1, Errors: 3, Skipped: 0

[JENKINS] Recording test results
[INFO]
[INFO] --- cargo-maven2-plugin:1.1.2:stop (stop-container) @ syncope-core ---
[INFO] Failsafe report directory: <http://jenkins.syncope-idm.org/job/Syncope%20trunk%20(Windows)/ws/core\target\failsafe-reports>
[INFO]
[INFO] --- maven-failsafe-plugin:2.9:verify (default) @ syncope-core ---
[JENKINS] Archiving <http://jenkins.syncope-idm.org/job/Syncope%20trunk%20(Windows)/ws/core\pom.xml> to /var/lib/jenkins/jobs/Syncope trunk (Windows)/modules/org.syncope$syncope-core/builds/2011-10-03_17-53-23/archive/org.syncope/syncope-core/0.7-SNAPSHOT/syncope-core-0.7-SNAPSHOT.pom
[JENKINS] Archiving <http://jenkins.syncope-idm.org/job/Syncope%20trunk%20(Windows)/ws/core\target\syncope.war> to /var/lib/jenkins/jobs/Syncope trunk (Windows)/modules/org.syncope$syncope-core/builds/2011-10-03_17-53-23/archive/org.syncope/syncope-core/0.7-SNAPSHOT/syncope-core-0.7-SNAPSHOT.war
[JENKINS] Archiving <http://jenkins.syncope-idm.org/job/Syncope%20trunk%20(Windows)/ws/core\target\syncope-classes.jar> to /var/lib/jenkins/jobs/Syncope trunk (Windows)/modules/org.syncope$syncope-core/builds/2011-10-03_17-53-23/archive/org.syncope/syncope-core/0.7-SNAPSHOT/syncope-core-0.7-SNAPSHOT-classes.jar
[INFO] ------------------------------------------------------------------------
[INFO] Reactor Summary:
[INFO]
[INFO] Syncope ........................................... SUCCESS [6.328s]
[INFO] Syncope build tools ............................... SUCCESS [35.297s]
[INFO] Syncope client .................................... SUCCESS [1:05.330s]
[INFO] Syncope core ...................................... FAILURE [4:54.054s]
[INFO] Syncope console ................................... SKIPPED
[INFO] Syncope archetype ................................. SKIPPED
[INFO] ------------------------------------------------------------------------
[INFO] BUILD FAILURE
[INFO] ------------------------------------------------------------------------
[INFO] Total time: 6:56.163s
[INFO] Finished at: Mon Oct 03 18:00:26 CEST 2011
[INFO] Final Memory: 40M/495M
[INFO] ------------------------------------------------------------------------
mavenExecutionResult exceptions not empty
message : Failed to execute goal org.apache.maven.plugins:maven-failsafe-plugin:2.9:verify (default) on project syncope-core: There are test failures.

Please refer to <http://jenkins.syncope-idm.org/job/Syncope%20trunk%20(Windows)/ws/core\target\failsafe-reports> for the individual test results.
cause : There are test failures.

Please refer to <http://jenkins.syncope-idm.org/job/Syncope%20trunk%20(Windows)/ws/core\target\failsafe-reports> for the individual test results.
Stack trace :
org.apache.maven.lifecycle.LifecycleExecutionException: Failed to execute goal org.apache.maven.plugins:maven-failsafe-plugin:2.9:verify (default) on project syncope-core: There are test failures.

Please refer to <http://jenkins.syncope-idm.org/job/Syncope%20trunk%20(Windows)/ws/core\target\failsafe-reports> for the individual test results.
        at org.apache.maven.lifecycle.internal.MojoExecutor.execute(MojoExecutor.java:213)
        at org.apache.maven.lifecycle.internal.MojoExecutor.execute(MojoExecutor.java:153)
        at org.apache.maven.lifecycle.internal.MojoExecutor.execute(MojoExecutor.java:145)
        at org.apache.maven.lifecycle.internal.LifecycleModuleBuilder.buildProject(LifecycleModuleBuilder.java:84)
        at org.apache.maven.lifecycle.internal.LifecycleModuleBuilder.buildProject(LifecycleModuleBuilder.java:59)
        at org.apache.maven.lifecycle.internal.LifecycleStarter.singleThreadedBuild(LifecycleStarter.java:183)
        at org.apache.maven.lifecycle.internal.LifecycleStarter.execute(LifecycleStarter.java:161)
        at org.apache.maven.DefaultMaven.doExecute(DefaultMaven.java:319)
        at org.apache.maven.DefaultMaven.execute(DefaultMaven.java:156)
        at org.jvnet.hudson.maven3.launcher.Maven3Launcher.main(Maven3Launcher.java:79)
        at sun.reflect.NativeMethodAccessorImpl.invoke0(Native Method)
        at sun.reflect.NativeMethodAccessorImpl.invoke(NativeMethodAccessorImpl.java:39)
        at sun.reflect.DelegatingMethodAccessorImpl.invoke(DelegatingMethodAccessorImpl.java:25)
        at java.lang.reflect.Method.invoke(Method.java:597)
        at org.codehaus.plexus.classworlds.launcher.Launcher.launchStandard(Launcher.java:329)
        at org.codehaus.plexus.classworlds.launcher.Launcher.launch(Launcher.java:239)
        at org.jvnet.hudson.maven3.agent.Maven3Main.launch(Maven3Main.java:158)
        at hudson.maven.Maven3Builder.call(Maven3Builder.java:122)
        at hudson.maven.Maven3Builder.call(Maven3Builder.java:74)
        at hudson.remoting.UserRequest.perform(UserRequest.java:118)
        at hudson.remoting.UserRequest.perform(UserRequest.java:48)
        at hudson.remoting.Request$2.run(Request.java:287)
        at java.util.concurrent.Executors$RunnableAdapter.call(Executors.java:441)
        at java.util.concurrent.FutureTask$Sync.innerRun(FutureTask.java:303)
        at java.util.concurrent.FutureTask.run(FutureTask.java:138)
        at java.util.concurrent.ThreadPoolExecutor$Worker.runTask(ThreadPoolExecutor.java:886)
        at java.util.concurrent.ThreadPoolExecutor$Worker.run(ThreadPoolExecutor.java:908)
        at java.lang.Thread.run(Thread.java:662)
Caused by: org.apache.maven.plugin.MojoFailureException: There are test failures.

Please refer to <http://jenkins.syncope-idm.org/job/Syncope%20trunk%20(Windows)/ws/core\target\failsafe-reports> for the individual test results.
        at org.apache.maven.plugin.surefire.SurefireHelper.reportExecution(SurefireHelper.java:126)
        at org.apache.maven.plugin.failsafe.VerifyMojo.execute(VerifyMojo.java:208)
        at org.apache.maven.plugin.DefaultBuildPluginManager.executeMojo(DefaultBuildPluginManager.java:101)
        at org.apache.maven.lifecycle.internal.MojoExecutor.execute(MojoExecutor.java:209)
        ... 27 more
Maven failed with error.
Sending e-mails to: [hidden email]
3-ott-2011 18.00.28 hudson.remoting.Channel$ReaderThread run
GRAVE: I/O error in channel channel
java.io.InvalidClassException: hudson.remoting.Channel$CloseCommand; local class incompatible: stream classdesc serialVersionUID = -6592593588803945669, local class serialVersionUID = 972857271608138115
        at java.io.ObjectStreamClass.initNonProxy(ObjectStreamClass.java:562)
        at java.io.ObjectInputStream.readNonProxyDesc(ObjectInputStream.java:1582)
        at java.io.ObjectInputStream.readClassDesc(ObjectInputStream.java:1495)
        at java.io.ObjectInputStream.readOrdinaryObject(ObjectInputStream.java:1731)
        at java.io.ObjectInputStream.readObject0(ObjectInputStream.java:1328)
        at java.io.ObjectInputStream.readObject(ObjectInputStream.java:350)
        at hudson.remoting.Channel$ReaderThread.run(Channel.java:1087)
channel stopped

Reply | Threaded
Open this post in threaded view
|

[syncope-dev] Jenkins build is back to normal : Syncope trunk (Windows) #41

jenkins