[syncope-dev] Build failed in Jenkins: Syncope trunk (GNU Linux) » Syncope core #44

classic Classic list List threaded Threaded
4 messages Options
Reply | Threaded
Open this post in threaded view
|

[syncope-dev] Build failed in Jenkins: Syncope trunk (GNU Linux) » Syncope core #44

jenkins
See <http://jenkins.syncope-idm.org/job/Syncope%20trunk%20(GNU%20Linux)/org.syncope$syncope-core/44/>

------------------------------------------
[INFO]                                                                        
[INFO] ------------------------------------------------------------------------
[INFO] Building Syncope core 0.7-SNAPSHOT
[INFO] ------------------------------------------------------------------------
[INFO]
[INFO] --- maven-clean-plugin:2.4.1:clean (default-clean) @ syncope-core ---
[INFO]
[INFO] --- maven-enforcer-plugin:1.0:enforce (enforce-maven) @ syncope-core ---
[INFO]
[INFO] --- syncope-build-tools:0.7-SNAPSHOT:set-dynamic-properties (set-dynamic-properties) @ syncope-core ---
[INFO]
[debug] execute contextualize
[INFO] --- maven-resources-plugin:2.5:resources (default-resources) @ syncope-core ---
[INFO] Using 'UTF-8' encoding to copy filtered resources.
[INFO] Copying 27 resources
[INFO]
[INFO] --- maven-compiler-plugin:2.3.2:compile (default-compile) @ syncope-core ---
[INFO] Compiling 205 source files to <http://jenkins.syncope-idm.org/job/Syncope%20trunk%20(GNU%20Linux)/org.syncope$syncope-core/ws/target/classes>
[INFO]
[INFO] --- maven-resources-plugin:2.5:testResources (default-testResources) @ syncope-core ---
[debug] execute contextualize
[INFO] Using 'UTF-8' encoding to copy filtered resources.
[INFO] Copying 11 resources
[INFO]
[INFO] --- maven-compiler-plugin:2.3.2:testCompile (default-testCompile) @ syncope-core ---
[INFO] Compiling 42 source files to <http://jenkins.syncope-idm.org/job/Syncope%20trunk%20(GNU%20Linux)/org.syncope$syncope-core/ws/target/test-classes>
[INFO]
[INFO] --- maven-surefire-plugin:2.9:test (default-test) @ syncope-core ---
[INFO] Tests are skipped.
[INFO]
[INFO] --- maven-surefire-plugin:2.9:test (test-phase-execution) @ syncope-core ---
[INFO] Surefire report directory: <http://jenkins.syncope-idm.org/job/Syncope%20trunk%20(GNU%20Linux)/org.syncope$syncope-core/ws/target/surefire-reports>

-------------------------------------------------------
 T E S T S
-------------------------------------------------------
Running jpasymphony.dao.JPAWorkflowEntryTest
Tests run: 1, Failures: 0, Errors: 0, Skipped: 0, Time elapsed: 8.531 sec
Running org.syncope.core.persistence.dao.SchemaTest
Tests run: 7, Failures: 0, Errors: 0, Skipped: 0, Time elapsed: 0.324 sec
Running org.syncope.core.persistence.dao.ConnInstanceTest
Tests run: 4, Failures: 0, Errors: 0, Skipped: 0, Time elapsed: 0.057 sec
Running org.syncope.core.persistence.dao.PolicyTest
Tests run: 9, Failures: 0, Errors: 0, Skipped: 0, Time elapsed: 0.171 sec
Running org.syncope.core.persistence.dao.TaskTest
Tests run: 4, Failures: 0, Errors: 0, Skipped: 0, Time elapsed: 6.313 sec
Running org.syncope.core.persistence.dao.TaskExecTest
Tests run: 2, Failures: 0, Errors: 0, Skipped: 0, Time elapsed: 0.065 sec
Running org.syncope.core.persistence.dao.DerAttrTest
Tests run: 6, Failures: 0, Errors: 0, Skipped: 0, Time elapsed: 0.147 sec
Running org.syncope.core.persistence.dao.VirSchemaTest
Tests run: 4, Failures: 0, Errors: 0, Skipped: 0, Time elapsed: 0.053 sec
Running org.syncope.core.persistence.dao.RoleTest
Tests run: 8, Failures: 0, Errors: 0, Skipped: 0, Time elapsed: 0.234 sec
Running org.syncope.core.persistence.dao.VirAttrTest
Tests run: 6, Failures: 0, Errors: 0, Skipped: 0, Time elapsed: 0.119 sec
Running org.syncope.core.persistence.dao.EntitlementTest
Tests run: 4, Failures: 0, Errors: 0, Skipped: 0, Time elapsed: 0.124 sec
Running org.syncope.core.persistence.dao.DerSchemaTest
Tests run: 4, Failures: 0, Errors: 0, Skipped: 0, Time elapsed: 0.069 sec
Running org.syncope.core.persistence.dao.MembershipTest
Tests run: 4, Failures: 0, Errors: 0, Skipped: 0, Time elapsed: 0.057 sec
Running org.syncope.core.persistence.dao.ResourceTest
Tests run: 6, Failures: 0, Errors: 0, Skipped: 0, Time elapsed: 0.132 sec
Running org.syncope.core.persistence.dao.UserSearchTest
Tests run: 7, Failures: 0, Errors: 0, Skipped: 0, Time elapsed: 2.426 sec
Running org.syncope.core.persistence.dao.UserTest
Tests run: 11, Failures: 0, Errors: 0, Skipped: 0, Time elapsed: 1.93 sec
Running org.syncope.core.persistence.dao.AttrTest
Tests run: 7, Failures: 0, Errors: 0, Skipped: 0, Time elapsed: 1.574 sec

Results :

Tests run: 94, Failures: 0, Errors: 0, Skipped: 0

[JENKINS] Recording test results
[INFO]
[INFO] --- maven-surefire-plugin:2.9:test (relationship-test-execution) @ syncope-core ---
[INFO] Surefire report directory: <http://jenkins.syncope-idm.org/job/Syncope%20trunk%20(GNU%20Linux)/org.syncope$syncope-core/ws/target/surefire-reports>

-------------------------------------------------------
 T E S T S
-------------------------------------------------------
Running jpasymphony.relationships.JPAWorkflowEntryTest
Tests run: 1, Failures: 0, Errors: 0, Skipped: 0, Time elapsed: 6.674 sec
Running org.syncope.core.persistence.relationships.SchemaTest
Tests run: 2, Failures: 0, Errors: 0, Skipped: 0, Time elapsed: 0.228 sec
Running org.syncope.core.persistence.relationships.TaskTest
Tests run: 6, Failures: 0, Errors: 0, Skipped: 0, Time elapsed: 0.539 sec
Running org.syncope.core.persistence.relationships.RoleTest
Tests run: 1, Failures: 0, Errors: 0, Skipped: 0, Time elapsed: 0.079 sec
Running org.syncope.core.persistence.relationships.DerSchemaTest
Tests run: 1, Failures: 0, Errors: 0, Skipped: 0, Time elapsed: 0.041 sec
Running org.syncope.core.persistence.relationships.MembershipTest
Tests run: 2, Failures: 0, Errors: 0, Skipped: 0, Time elapsed: 0.116 sec
Running org.syncope.core.persistence.relationships.ResourceTest
Tests run: 3, Failures: 0, Errors: 0, Skipped: 0, Time elapsed: 0.196 sec
Running org.syncope.core.persistence.relationships.UserTest
Tests run: 1, Failures: 0, Errors: 0, Skipped: 0, Time elapsed: 0.052 sec
Running org.syncope.core.persistence.relationships.AttrTest
Tests run: 3, Failures: 0, Errors: 0, Skipped: 0, Time elapsed: 0.119 sec

Results :

Tests run: 20, Failures: 0, Errors: 0, Skipped: 0

[JENKINS] Recording test results
[INFO]
[INFO] --- maven-war-plugin:2.1.1:war (default-war) @ syncope-core ---
[INFO] Packaging webapp
[INFO] Assembling webapp [syncope-core] in [<http://jenkins.syncope-idm.org/job/Syncope%20trunk%20(GNU%20Linux)/org.syncope$syncope-core/ws/target/syncope]>
[INFO] Processing war project
[INFO] Copying webapp webResources [<http://jenkins.syncope-idm.org/job/Syncope%20trunk%20(GNU%20Linux)/org.syncope$syncope-core/ws/src/main/webapp]> to [<http://jenkins.syncope-idm.org/job/Syncope%20trunk%20(GNU%20Linux)/org.syncope$syncope-core/ws/target/syncope]>
[INFO] Copying webapp resources [<http://jenkins.syncope-idm.org/job/Syncope%20trunk%20(GNU%20Linux)/org.syncope$syncope-core/ws/src/main/webapp]>
[INFO] Webapp assembled in [404 msecs]
[INFO] Building war: <http://jenkins.syncope-idm.org/job/Syncope%20trunk%20(GNU%20Linux)/org.syncope$syncope-core/ws/target/syncope.war>
[INFO] WEB-INF/web.xml already added, skipping
[INFO] Packaging classes
[INFO] Building jar: <http://jenkins.syncope-idm.org/job/Syncope%20trunk%20(GNU%20Linux)/org.syncope$syncope-core/ws/target/syncope-classes.jar>
[INFO]
[INFO] --- maven-antrun-plugin:1.6:run (explodeSyncopeWAR) @ syncope-core ---
[INFO] Executing tasks

main:
    [unzip] Expanding: <http://jenkins.syncope-idm.org/job/Syncope%20trunk%20(GNU%20Linux)/org.syncope$syncope-core/ws/target/syncope.war> into <http://jenkins.syncope-idm.org/job/Syncope%20trunk%20(GNU%20Linux)/org.syncope$syncope-core/ws/target/syncope-core-test>
[INFO] Executed tasks
[INFO]
[INFO] --- maven-antrun-plugin:1.6:run (setupTomcat) @ syncope-core ---
[INFO] Executing tasks

main:
      [get] Destination already exists (skipping): /tmp/apache-tomcat-7.0.21.zip
    [unzip] Expanding: /tmp/apache-tomcat-7.0.21.zip into /tmp
[INFO] Executed tasks
[INFO]
[INFO] --- maven-antrun-plugin:1.6:run (setupCSV) @ syncope-core ---
[INFO] Executing tasks

main:
     [copy] Copying 1 file to /tmp
[INFO] Executed tasks
[INFO]
[INFO] --- maven-dependency-plugin:2.3:copy (set-bundles) @ syncope-core ---
[INFO] Configured Artifact: org.connid.bundles.soap:org.connid.bundles.soap:1.1:jar
[INFO] Configured Artifact: org.connid.bundles.db:org.connid.bundles.db.table:1.2.1:jar
[INFO] Configured Artifact: org.connid.bundles:org.connid.bundles.csvdir:0.1:jar
[INFO] Copying org.connid.bundles.soap-1.1.jar to <http://jenkins.syncope-idm.org/job/Syncope%20trunk%20(GNU%20Linux)/org.syncope$syncope-core/ws/target/bundles/org.connid.bundles.soap-1.1.jar>
[INFO] Copying org.connid.bundles.db.table-1.2.1.jar to <http://jenkins.syncope-idm.org/job/Syncope%20trunk%20(GNU%20Linux)/org.syncope$syncope-core/ws/target/bundles/org.connid.bundles.db.table-1.2.1.jar>
[INFO] Copying org.connid.bundles.csvdir-0.1.jar to <http://jenkins.syncope-idm.org/job/Syncope%20trunk%20(GNU%20Linux)/org.syncope$syncope-core/ws/target/bundles/org.connid.bundles.csvdir-0.1.jar>
[INFO]
[INFO] --- maven-hsqldb-plugin:1.0:run (startTestDb) @ syncope-core ---
[Server@3502f809]: [Thread[pool-1-thread-1,5,main]]: setSilent(true)
[Server@3502f809]: Initiating startup sequence...
[Server@3502f809]: Server socket opened successfully in 1 ms.
[Server@3502f809]: Database [index=0, id=0, db=mem:testdb, alias=testdb] opened sucessfully in 257 ms.
[Server@3502f809]: Startup sequence completed in 264 ms.
[Server@3502f809]: 2011-10-03 14:03:41.192 HSQLDB server 2.2.4 is online on port 9001
[Server@3502f809]: To close normally, connect and execute SHUTDOWN SQL
[Server@3502f809]: From command line, use [Ctrl]+[C] to abort abruptly
[INFO] HSQL Launched
[INFO] ONLINE
[INFO] Live name: testdb
[INFO]
[INFO] --- sql-maven-plugin:1.4:execute (loadTestDb) @ syncope-core ---
[INFO] Executing file: /tmp/testdb.803294765sql
[INFO] 4 of 4 SQL statements executed successfully
[INFO]
[INFO] --- cargo-maven2-plugin:1.1.2:start (start-container) @ syncope-core ---
[INFO]
[INFO] --- maven-failsafe-plugin:2.9:integration-test (default) @ syncope-core ---
[INFO] Failsafe report directory: <http://jenkins.syncope-idm.org/job/Syncope%20trunk%20(GNU%20Linux)/org.syncope$syncope-core/ws/target/failsafe-reports>

-------------------------------------------------------
 T E S T S
-------------------------------------------------------
Running org.syncope.core.rest.TaskTestITCase
Tests run: 10, Failures: 1, Errors: 0, Skipped: 0, Time elapsed: 70.357 sec <<< FAILURE!
Running org.syncope.core.rest.AuthenticationTestITCase
Tests run: 4, Failures: 0, Errors: 0, Skipped: 0, Time elapsed: 1.751 sec
Running org.syncope.core.rest.UserTestITCase
Tests run: 22, Failures: 0, Errors: 0, Skipped: 0, Time elapsed: 6.273 sec
Running org.syncope.core.rest.PolicyTestITCase
Tests run: 9, Failures: 0, Errors: 0, Skipped: 0, Time elapsed: 0.64 sec
Running org.syncope.core.rest.SchemaTestITCase
Tests run: 4, Failures: 0, Errors: 0, Skipped: 0, Time elapsed: 0.567 sec
Running org.syncope.core.rest.LogTestITCase
Tests run: 1, Failures: 0, Errors: 0, Skipped: 0, Time elapsed: 0.041 sec
Running org.syncope.core.rest.ConfigurationTestITCase
Tests run: 5, Failures: 0, Errors: 0, Skipped: 0, Time elapsed: 0.41 sec
Running org.syncope.core.rest.DerivedSchemaTestITCase
Tests run: 5, Failures: 0, Errors: 0, Skipped: 0, Time elapsed: 0.296 sec
Running org.syncope.core.rest.RoleTestITCase
Tests run: 10, Failures: 0, Errors: 0, Skipped: 0, Time elapsed: 0.649 sec
Running org.syncope.core.rest.ResourceTestITCase
Tests run: 13, Failures: 0, Errors: 0, Skipped: 0, Time elapsed: 0.697 sec
Running org.syncope.core.rest.ConnInstanceTestITCase
Tests run: 10, Failures: 0, Errors: 0, Skipped: 0, Time elapsed: 0.916 sec
Running org.syncope.core.rest.VirtualSchemaTestITCase
Tests run: 4, Failures: 0, Errors: 0, Skipped: 0, Time elapsed: 0.213 sec

Results :

Failed tests:   sync(org.syncope.core.rest.TaskTestITCase): Expected 410, found 4

Tests run: 97, Failures: 1, Errors: 0, Skipped: 0

[JENKINS] Recording test results
[INFO]
[INFO] --- cargo-maven2-plugin:1.1.2:stop (stop-container) @ syncope-core ---
[INFO]
[INFO] --- maven-failsafe-plugin:2.9:verify (default) @ syncope-core ---
[INFO] Failsafe report directory: <http://jenkins.syncope-idm.org/job/Syncope%20trunk%20(GNU%20Linux)/org.syncope$syncope-core/ws/target/failsafe-reports>
[JENKINS] Archiving <http://jenkins.syncope-idm.org/job/Syncope%20trunk%20(GNU%20Linux)/org.syncope$syncope-core/ws/pom.xml> to /var/lib/jenkins/jobs/Syncope trunk (GNU Linux)/modules/org.syncope$syncope-core/builds/2011-10-03_14-01-24/archive/org.syncope/syncope-core/0.7-SNAPSHOT/syncope-core-0.7-SNAPSHOT.pom
[JENKINS] Archiving <http://jenkins.syncope-idm.org/job/Syncope%20trunk%20(GNU%20Linux)/org.syncope$syncope-core/ws/target/syncope.war> to /var/lib/jenkins/jobs/Syncope trunk (GNU Linux)/modules/org.syncope$syncope-core/builds/2011-10-03_14-01-24/archive/org.syncope/syncope-core/0.7-SNAPSHOT/syncope-core-0.7-SNAPSHOT.war
[JENKINS] Archiving <http://jenkins.syncope-idm.org/job/Syncope%20trunk%20(GNU%20Linux)/org.syncope$syncope-core/ws/target/syncope-classes.jar> to /var/lib/jenkins/jobs/Syncope trunk (GNU Linux)/modules/org.syncope$syncope-core/builds/2011-10-03_14-01-24/archive/org.syncope/syncope-core/0.7-SNAPSHOT/syncope-core-0.7-SNAPSHOT-classes.jar

Reply | Threaded
Open this post in threaded view
|

[syncope-dev] Build failed in Jenkins: Syncope trunk (GNU Linux) » Syncope core #45

jenkins
See <http://jenkins.syncope-idm.org/job/Syncope%20trunk%20(GNU%20Linux)/org.syncope$syncope-core/45/changes>

Changes:

[chicchiricco] Refactoring stuff for new workflow adapter + implementing NoOpUserWorkflowAdapter

------------------------------------------
[...truncated 36 lines...]
Downloading: http://repo1.maven.org/maven2/org/aspectj/aspectjweaver/1.6.8/aspectjweaver-1.6.8.pom
Downloaded: http://repo1.maven.org/maven2/org/aspectj/aspectjweaver/1.6.8/aspectjweaver-1.6.8.pom (908 B at 1.8 KB/sec)
Downloading: http://repo1.maven.org/maven2/net/sf/ehcache/ehcache-core/2.4.5/ehcache-core-2.4.5.pom
Downloaded: http://repo1.maven.org/maven2/net/sf/ehcache/ehcache-core/2.4.5/ehcache-core-2.4.5.pom (29 KB at 95.1 KB/sec)
Downloading: http://repo1.maven.org/maven2/net/sf/ehcache/ehcache-parent/2.3/ehcache-parent-2.3.pom
Downloaded: http://repo1.maven.org/maven2/net/sf/ehcache/ehcache-parent/2.3/ehcache-parent-2.3.pom (16 KB at 33.4 KB/sec)
Downloading: http://repo1.maven.org/maven2/org/activiti/activiti-engine/5.7/activiti-engine-5.7.jar
Downloading: http://repo1.maven.org/maven2/javax/mail/mail/1.4.1/mail-1.4.1.jar
Downloading: http://repo1.maven.org/maven2/org/livetribe/livetribe-jsr223/2.0.6/livetribe-jsr223-2.0.6.jar
Downloading: http://repo1.maven.org/maven2/org/mybatis/mybatis/3.0.4/mybatis-3.0.4.jar
Downloading: http://repo1.maven.org/maven2/org/apache/commons/commons-email/1.2/commons-email-1.2.jar
Downloading: http://repo1.maven.org/maven2/org/activiti/activiti-spring/5.7/activiti-spring-5.7.jar
Downloading: http://repo1.maven.org/maven2/commons-dbcp/commons-dbcp/1.4/commons-dbcp-1.4.jar
Downloaded: http://repo1.maven.org/maven2/org/livetribe/livetribe-jsr223/2.0.6/livetribe-jsr223-2.0.6.jar (15 KB at 9.3 KB/sec)
Downloading: http://repo1.maven.org/maven2/commons-pool/commons-pool/1.5.4/commons-pool-1.5.4.jar
Downloaded: http://repo1.maven.org/maven2/javax/mail/mail/1.4.1/mail-1.4.1.jar (438 KB at 189.9 KB/sec)
Downloading: http://repo1.maven.org/maven2/org/aspectj/aspectjrt/1.6.8/aspectjrt-1.6.8.jar
Downloaded: http://repo1.maven.org/maven2/org/apache/commons/commons-email/1.2/commons-email-1.2.jar (32 KB at 12.4 KB/sec)
Downloading: http://repo1.maven.org/maven2/org/aspectj/aspectjweaver/1.6.8/aspectjweaver-1.6.8.jar
Downloaded: http://repo1.maven.org/maven2/commons-dbcp/commons-dbcp/1.4/commons-dbcp-1.4.jar (157 KB at 104.4 KB/sec)
Downloading: http://repo1.maven.org/maven2/net/sf/ehcache/ehcache-core/2.4.5/ehcache-core-2.4.5.jar
Downloaded: http://repo1.maven.org/maven2/commons-pool/commons-pool/1.5.4/commons-pool-1.5.4.jar (94 KB at 47.1 KB/sec)
Downloaded: http://repo1.maven.org/maven2/org/mybatis/mybatis/3.0.4/mybatis-3.0.4.jar (626 KB at 154.0 KB/sec)
Downloaded: http://repo1.maven.org/maven2/org/aspectj/aspectjrt/1.6.8/aspectjrt-1.6.8.jar (114 KB at 56.5 KB/sec)
Downloaded: http://repo1.maven.org/maven2/net/sf/ehcache/ehcache-core/2.4.5/ehcache-core-2.4.5.jar (983 KB at 311.0 KB/sec)
Downloaded: http://repo1.maven.org/maven2/org/aspectj/aspectjweaver/1.6.8/aspectjweaver-1.6.8.jar (1590 KB at 316.8 KB/sec)
Downloading: http://repository.jboss.org/nexus/content/groups/public-jboss/org/activiti/activiti-engine/5.7/activiti-engine-5.7.jar
Downloading: http://repository.jboss.org/nexus/content/groups/public-jboss/org/activiti/activiti-spring/5.7/activiti-spring-5.7.jar
Downloading: http://maven.alfresco.com/nexus/content/repositories/activiti/org/activiti/activiti-engine/5.7/activiti-engine-5.7.jar
Downloading: http://maven.alfresco.com/nexus/content/repositories/activiti/org/activiti/activiti-spring/5.7/activiti-spring-5.7.jar
Downloaded: http://maven.alfresco.com/nexus/content/repositories/activiti/org/activiti/activiti-spring/5.7/activiti-spring-5.7.jar (22 KB at 51.6 KB/sec)
Downloaded: http://maven.alfresco.com/nexus/content/repositories/activiti/org/activiti/activiti-engine/5.7/activiti-engine-5.7.jar (1038 KB at 421.5 KB/sec)
[INFO]
[INFO] --- maven-clean-plugin:2.4.1:clean (default-clean) @ syncope-core ---
[INFO]
[INFO] --- maven-enforcer-plugin:1.0:enforce (enforce-maven) @ syncope-core ---
[INFO]
[INFO] --- syncope-build-tools:0.7-SNAPSHOT:set-dynamic-properties (set-dynamic-properties) @ syncope-core ---
[INFO]
[INFO] [debug] execute contextualize
--- maven-resources-plugin:2.5:resources (default-resources) @ syncope-core ---
[INFO] Using 'UTF-8' encoding to copy filtered resources.
[INFO] Copying 25 resources
[INFO]
[INFO] --- maven-compiler-plugin:2.3.2:compile (default-compile) @ syncope-core ---
[INFO] Compiling 188 source files to <http://jenkins.syncope-idm.org/job/Syncope%20trunk%20(GNU%20Linux)/org.syncope$syncope-core/ws/target/classes>
[INFO]
[INFO] --- maven-resources-plugin:2.5:testResources (default-testResources) @ syncope-core ---
[debug] execute contextualize
[INFO] Using 'UTF-8' encoding to copy filtered resources.
[INFO] Copying 12 resources
[INFO]
[INFO] --- maven-dependency-plugin:2.3:copy (set-bundles) @ syncope-core ---
[INFO] Configured Artifact: org.connid.bundles.soap:org.connid.bundles.soap:1.1:jar
[INFO] Configured Artifact: org.connid.bundles.db:org.connid.bundles.db.table:1.2.1:jar
[INFO] Configured Artifact: org.connid.bundles:org.connid.bundles.csvdir:0.1:jar
[INFO] Copying org.connid.bundles.soap-1.1.jar to <http://jenkins.syncope-idm.org/job/Syncope%20trunk%20(GNU%20Linux)/org.syncope$syncope-core/ws/target/bundles/org.connid.bundles.soap-1.1.jar>
[INFO] Copying org.connid.bundles.db.table-1.2.1.jar to <http://jenkins.syncope-idm.org/job/Syncope%20trunk%20(GNU%20Linux)/org.syncope$syncope-core/ws/target/bundles/org.connid.bundles.db.table-1.2.1.jar>
[INFO] Copying org.connid.bundles.csvdir-0.1.jar to <http://jenkins.syncope-idm.org/job/Syncope%20trunk%20(GNU%20Linux)/org.syncope$syncope-core/ws/target/bundles/org.connid.bundles.csvdir-0.1.jar>
[INFO]
[INFO] --- maven-compiler-plugin:2.3.2:testCompile (default-testCompile) @ syncope-core ---
[INFO] Compiling 40 source files to <http://jenkins.syncope-idm.org/job/Syncope%20trunk%20(GNU%20Linux)/org.syncope$syncope-core/ws/target/test-classes>
[INFO]
[INFO] --- maven-surefire-plugin:2.9:test (default-test) @ syncope-core ---
[INFO] Tests are skipped.
[INFO]
[INFO] --- maven-surefire-plugin:2.9:test (test-phase-execution) @ syncope-core ---
[INFO] Surefire report directory: <http://jenkins.syncope-idm.org/job/Syncope%20trunk%20(GNU%20Linux)/org.syncope$syncope-core/ws/target/surefire-reports>

-------------------------------------------------------
 T E S T S
-------------------------------------------------------
Running org.syncope.core.persistence.dao.SchemaTest
Tests run: 7, Failures: 0, Errors: 0, Skipped: 0, Time elapsed: 8.491 sec
Running org.syncope.core.persistence.dao.ConnInstanceTest
Tests run: 4, Failures: 0, Errors: 0, Skipped: 0, Time elapsed: 0.054 sec
Running org.syncope.core.persistence.dao.PolicyTest
Tests run: 9, Failures: 0, Errors: 0, Skipped: 0, Time elapsed: 0.113 sec
Running org.syncope.core.persistence.dao.TaskTest
Tests run: 4, Failures: 0, Errors: 0, Skipped: 0, Time elapsed: 0.249 sec
Running org.syncope.core.persistence.dao.TaskExecTest
Tests run: 2, Failures: 0, Errors: 0, Skipped: 0, Time elapsed: 0.057 sec
Running org.syncope.core.persistence.dao.DerAttrTest
Tests run: 6, Failures: 0, Errors: 0, Skipped: 0, Time elapsed: 0.14 sec
Running org.syncope.core.persistence.dao.VirSchemaTest
Tests run: 4, Failures: 0, Errors: 0, Skipped: 0, Time elapsed: 0.051 sec
Running org.syncope.core.persistence.dao.RoleTest
Tests run: 8, Failures: 0, Errors: 0, Skipped: 0, Time elapsed: 0.219 sec
Running org.syncope.core.persistence.dao.VirAttrTest
Tests run: 6, Failures: 0, Errors: 0, Skipped: 0, Time elapsed: 0.097 sec
Running org.syncope.core.persistence.dao.EntitlementTest
Tests run: 4, Failures: 0, Errors: 0, Skipped: 0, Time elapsed: 0.109 sec
Running org.syncope.core.persistence.dao.DerSchemaTest
Tests run: 4, Failures: 0, Errors: 0, Skipped: 0, Time elapsed: 0.045 sec
Running org.syncope.core.persistence.dao.MembershipTest
Tests run: 4, Failures: 0, Errors: 0, Skipped: 0, Time elapsed: 0.079 sec
Running org.syncope.core.persistence.dao.ResourceTest
Tests run: 6, Failures: 0, Errors: 0, Skipped: 0, Time elapsed: 0.154 sec
Running org.syncope.core.persistence.dao.UserSearchTest
Tests run: 7, Failures: 0, Errors: 0, Skipped: 0, Time elapsed: 0.491 sec
Running org.syncope.core.persistence.dao.UserTest
Tests run: 11, Failures: 0, Errors: 0, Skipped: 0, Time elapsed: 0.726 sec
Running org.syncope.core.persistence.dao.AttrTest
Tests run: 7, Failures: 0, Errors: 0, Skipped: 0, Time elapsed: 0.108 sec
Running org.syncope.core.rest.data.ResourceDataBinderTest
Tests run: 2, Failures: 0, Errors: 0, Skipped: 0, Time elapsed: 0.006 sec
Running org.syncope.core.init.ConnInstanceLoaderTest
Tests run: 2, Failures: 0, Errors: 0, Skipped: 0, Time elapsed: 0.221 sec

Results :

Tests run: 97, Failures: 0, Errors: 0, Skipped: 0

[JENKINS] Recording test results
[INFO]
[INFO] --- maven-surefire-plugin:2.9:test (relationship-test-execution) @ syncope-core ---
[INFO] Surefire report directory: <http://jenkins.syncope-idm.org/job/Syncope%20trunk%20(GNU%20Linux)/org.syncope$syncope-core/ws/target/surefire-reports>

-------------------------------------------------------
 T E S T S
-------------------------------------------------------
Running org.syncope.core.persistence.relationships.SchemaTest
Tests run: 2, Failures: 0, Errors: 0, Skipped: 0, Time elapsed: 6.782 sec
Running org.syncope.core.persistence.relationships.TaskTest
Tests run: 6, Failures: 0, Errors: 0, Skipped: 0, Time elapsed: 0.278 sec
Running org.syncope.core.persistence.relationships.RoleTest
Tests run: 1, Failures: 0, Errors: 0, Skipped: 0, Time elapsed: 0.083 sec
Running org.syncope.core.persistence.relationships.DerSchemaTest
Tests run: 1, Failures: 0, Errors: 0, Skipped: 0, Time elapsed: 0.044 sec
Running org.syncope.core.persistence.relationships.MembershipTest
Tests run: 2, Failures: 0, Errors: 0, Skipped: 0, Time elapsed: 0.118 sec
Running org.syncope.core.persistence.relationships.ResourceTest
Tests run: 3, Failures: 0, Errors: 0, Skipped: 0, Time elapsed: 0.208 sec
Running org.syncope.core.persistence.relationships.UserTest
Tests run: 1, Failures: 0, Errors: 0, Skipped: 0, Time elapsed: 0.054 sec
Running org.syncope.core.persistence.relationships.AttrTest
Tests run: 3, Failures: 0, Errors: 0, Skipped: 0, Time elapsed: 0.1 sec

Results :

Tests run: 19, Failures: 0, Errors: 0, Skipped: 0

[JENKINS] Recording test results
[INFO]
[INFO] --- maven-war-plugin:2.1.1:war (default-war) @ syncope-core ---
[INFO] Packaging webapp
[INFO] Assembling webapp [syncope-core] in [<http://jenkins.syncope-idm.org/job/Syncope%20trunk%20(GNU%20Linux)/org.syncope$syncope-core/ws/target/syncope]>
[INFO] Processing war project
[INFO] Copying webapp webResources [<http://jenkins.syncope-idm.org/job/Syncope%20trunk%20(GNU%20Linux)/org.syncope$syncope-core/ws/src/main/webapp]> to [<http://jenkins.syncope-idm.org/job/Syncope%20trunk%20(GNU%20Linux)/org.syncope$syncope-core/ws/target/syncope]>
[INFO] Copying webapp resources [<http://jenkins.syncope-idm.org/job/Syncope%20trunk%20(GNU%20Linux)/org.syncope$syncope-core/ws/src/main/webapp]>
[INFO] Webapp assembled in [415 msecs]
[INFO] Building war: <http://jenkins.syncope-idm.org/job/Syncope%20trunk%20(GNU%20Linux)/org.syncope$syncope-core/ws/target/syncope.war>
[INFO] WEB-INF/web.xml already added, skipping
[INFO] Packaging classes
[INFO] Building jar: <http://jenkins.syncope-idm.org/job/Syncope%20trunk%20(GNU%20Linux)/org.syncope$syncope-core/ws/target/syncope-classes.jar>
[INFO]
[INFO] --- maven-antrun-plugin:1.6:run (explodeSyncopeWAR) @ syncope-core ---
[INFO] Executing tasks

main:
    [unzip] Expanding: <http://jenkins.syncope-idm.org/job/Syncope%20trunk%20(GNU%20Linux)/org.syncope$syncope-core/ws/target/syncope.war> into <http://jenkins.syncope-idm.org/job/Syncope%20trunk%20(GNU%20Linux)/org.syncope$syncope-core/ws/target/syncope-core-test>
[INFO] Executed tasks
[INFO]
[INFO] --- maven-antrun-plugin:1.6:run (setupTomcat) @ syncope-core ---
[INFO] Executing tasks

main:
      [get] Getting: http://www.apache.org/dist/tomcat/tomcat-7/v7.0.22/bin/apache-tomcat-7.0.22.zip
      [get] To: /tmp/apache-tomcat-7.0.22.zip
    [unzip] Expanding: /tmp/apache-tomcat-7.0.22.zip into /tmp
[INFO] Executed tasks
[INFO]
[INFO] --- maven-antrun-plugin:1.6:run (setupCSV) @ syncope-core ---
[INFO] Executing tasks

main:
     [copy] Copying 1 file to /tmp
[INFO] Executed tasks
[INFO]
[INFO] --- maven-hsqldb-plugin:1.0:run (startTestDb) @ syncope-core ---
[Server@3c818836]: [Thread[pool-1-thread-1,5,main]]: setSilent(true)
[Server@3c818836]: Initiating startup sequence...
[Server@3c818836]: Server socket opened successfully in 1 ms.
[Server@3c818836]: Database [index=0, id=0, db=mem:testdb, alias=testdb] opened sucessfully in 242 ms.
[Server@3c818836]: Startup sequence completed in 249 ms.
[Server@3c818836]: 2011-10-03 14:14:28.076 HSQLDB server 2.2.4 is online on port 9001
[Server@3c818836]: To close normally, connect and execute SHUTDOWN SQL
[Server@3c818836]: From command line, use [Ctrl]+[C] to abort abruptly
[INFO] HSQL Launched
[INFO] ONLINE
[INFO] Live name: testdb
[INFO]
[INFO] --- sql-maven-plugin:1.4:execute (loadTestDb) @ syncope-core ---
[INFO] Executing file: /tmp/testdb.1877643902sql
[INFO] 4 of 4 SQL statements executed successfully
[INFO]
[INFO] --- cargo-maven2-plugin:1.1.2:start (start-container) @ syncope-core ---
[INFO]
[INFO] --- maven-failsafe-plugin:2.9:integration-test (default) @ syncope-core ---
[INFO] Failsafe report directory: <http://jenkins.syncope-idm.org/job/Syncope%20trunk%20(GNU%20Linux)/org.syncope$syncope-core/ws/target/failsafe-reports>

-------------------------------------------------------
 T E S T S
-------------------------------------------------------
Running org.syncope.core.rest.TaskTestITCase
Tests run: 10, Failures: 1, Errors: 0, Skipped: 0, Time elapsed: 48.865 sec <<< FAILURE!
Running org.syncope.core.rest.AuthenticationTestITCase
Tests run: 4, Failures: 0, Errors: 0, Skipped: 0, Time elapsed: 1.827 sec
Running org.syncope.core.rest.UserTestITCase
Tests run: 21, Failures: 0, Errors: 2, Skipped: 0, Time elapsed: 5.576 sec <<< FAILURE!
Running org.syncope.core.rest.PolicyTestITCase
Tests run: 9, Failures: 0, Errors: 0, Skipped: 0, Time elapsed: 3.257 sec
Running org.syncope.core.rest.SchemaTestITCase
Tests run: 4, Failures: 0, Errors: 0, Skipped: 0, Time elapsed: 0.871 sec
Running org.syncope.core.rest.LogTestITCase
Tests run: 1, Failures: 0, Errors: 0, Skipped: 0, Time elapsed: 0.128 sec
Running org.syncope.core.rest.ConfigurationTestITCase
Tests run: 5, Failures: 0, Errors: 0, Skipped: 0, Time elapsed: 0.409 sec
Running org.syncope.core.rest.DerivedSchemaTestITCase
Tests run: 5, Failures: 0, Errors: 0, Skipped: 0, Time elapsed: 0.38 sec
Running org.syncope.core.rest.RoleTestITCase
Tests run: 10, Failures: 0, Errors: 0, Skipped: 0, Time elapsed: 0.816 sec
Running org.syncope.core.rest.ResourceTestITCase
Tests run: 13, Failures: 0, Errors: 0, Skipped: 0, Time elapsed: 1.238 sec
Running org.syncope.core.rest.ConnInstanceTestITCase
Tests run: 10, Failures: 0, Errors: 1, Skipped: 0, Time elapsed: 0.869 sec <<< FAILURE!
Running org.syncope.core.rest.VirtualSchemaTestITCase
Tests run: 4, Failures: 0, Errors: 0, Skipped: 0, Time elapsed: 0.218 sec

Results :

Failed tests:   deal(org.syncope.core.rest.TaskTestITCase): expected:<[]SUBMITTED> but was:<[UN]SUBMITTED>

Tests in error:
  create(org.syncope.core.rest.UserTestITCase): {[Propagation [ws-target-resource-2]], }
  verifyTaskRegistration(org.syncope.core.rest.UserTestITCase): {[Propagation [ws-target-resource-2]], }
  getSchemaNames(org.syncope.core.rest.ConnInstanceTestITCase): 500 Internal Server Error

Tests run: 96, Failures: 1, Errors: 3, Skipped: 0

[JENKINS] Recording test results
[INFO]
[INFO] --- cargo-maven2-plugin:1.1.2:stop (stop-container) @ syncope-core ---
[INFO]
[INFO] --- maven-failsafe-plugin:2.9:verify (default) @ syncope-core ---
[INFO] Failsafe report directory: <http://jenkins.syncope-idm.org/job/Syncope%20trunk%20(GNU%20Linux)/org.syncope$syncope-core/ws/target/failsafe-reports>
[JENKINS] Archiving <http://jenkins.syncope-idm.org/job/Syncope%20trunk%20(GNU%20Linux)/org.syncope$syncope-core/ws/pom.xml> to /var/lib/jenkins/jobs/Syncope trunk (GNU Linux)/modules/org.syncope$syncope-core/builds/2011-10-03_14-11-25/archive/org.syncope/syncope-core/0.7-SNAPSHOT/syncope-core-0.7-SNAPSHOT.pom
[JENKINS] Archiving <http://jenkins.syncope-idm.org/job/Syncope%20trunk%20(GNU%20Linux)/org.syncope$syncope-core/ws/target/syncope.war> to /var/lib/jenkins/jobs/Syncope trunk (GNU Linux)/modules/org.syncope$syncope-core/builds/2011-10-03_14-11-25/archive/org.syncope/syncope-core/0.7-SNAPSHOT/syncope-core-0.7-SNAPSHOT.war
[JENKINS] Archiving <http://jenkins.syncope-idm.org/job/Syncope%20trunk%20(GNU%20Linux)/org.syncope$syncope-core/ws/target/syncope-classes.jar> to /var/lib/jenkins/jobs/Syncope trunk (GNU Linux)/modules/org.syncope$syncope-core/builds/2011-10-03_14-11-25/archive/org.syncope/syncope-core/0.7-SNAPSHOT/syncope-core-0.7-SNAPSHOT-classes.jar

Reply | Threaded
Open this post in threaded view
|

[syncope-dev] Build failed in Jenkins: Syncope trunk (GNU Linux) » Syncope core #46

jenkins
See <http://jenkins.syncope-idm.org/job/Syncope%20trunk%20(GNU%20Linux)/org.syncope$syncope-core/46/>

------------------------------------------
[INFO]                                                                        
[INFO] ------------------------------------------------------------------------
[INFO] Building Syncope core 0.7-SNAPSHOT
[INFO] ------------------------------------------------------------------------
[INFO]
[INFO] --- maven-clean-plugin:2.4.1:clean (default-clean) @ syncope-core ---
[INFO]
[INFO] --- maven-enforcer-plugin:1.0:enforce (enforce-maven) @ syncope-core ---
[INFO]
[INFO] --- syncope-build-tools:0.7-SNAPSHOT:set-dynamic-properties (set-dynamic-properties) @ syncope-core ---
[INFO] [debug] execute contextualize

[INFO] --- maven-resources-plugin:2.5:resources (default-resources) @ syncope-core ---
[INFO] Using 'UTF-8' encoding to copy filtered resources.
[INFO] Copying 25 resources
[INFO]
[INFO] --- maven-compiler-plugin:2.3.2:compile (default-compile) @ syncope-core ---
[INFO] Compiling 188 source files to <http://jenkins.syncope-idm.org/job/Syncope%20trunk%20(GNU%20Linux)/org.syncope$syncope-core/ws/target/classes>
[INFO]
[debug] execute contextualize
[INFO] --- maven-resources-plugin:2.5:testResources (default-testResources) @ syncope-core ---
[INFO] Using 'UTF-8' encoding to copy filtered resources.
[INFO] Copying 12 resources
[INFO]
[INFO] --- maven-dependency-plugin:2.3:copy (set-bundles) @ syncope-core ---
[INFO] Configured Artifact: org.connid.bundles.soap:org.connid.bundles.soap:1.1:jar
[INFO] Configured Artifact: org.connid.bundles.db:org.connid.bundles.db.table:1.2.1:jar
[INFO] Configured Artifact: org.connid.bundles:org.connid.bundles.csvdir:0.1:jar
[INFO] Copying org.connid.bundles.soap-1.1.jar to <http://jenkins.syncope-idm.org/job/Syncope%20trunk%20(GNU%20Linux)/org.syncope$syncope-core/ws/target/bundles/org.connid.bundles.soap-1.1.jar>
[INFO] Copying org.connid.bundles.db.table-1.2.1.jar to <http://jenkins.syncope-idm.org/job/Syncope%20trunk%20(GNU%20Linux)/org.syncope$syncope-core/ws/target/bundles/org.connid.bundles.db.table-1.2.1.jar>
[INFO] Copying org.connid.bundles.csvdir-0.1.jar to <http://jenkins.syncope-idm.org/job/Syncope%20trunk%20(GNU%20Linux)/org.syncope$syncope-core/ws/target/bundles/org.connid.bundles.csvdir-0.1.jar>
[INFO]
[INFO] --- maven-compiler-plugin:2.3.2:testCompile (default-testCompile) @ syncope-core ---
[INFO] Compiling 40 source files to <http://jenkins.syncope-idm.org/job/Syncope%20trunk%20(GNU%20Linux)/org.syncope$syncope-core/ws/target/test-classes>
[INFO]
[INFO] --- maven-surefire-plugin:2.9:test (default-test) @ syncope-core ---
[INFO] Tests are skipped.
[INFO]
[INFO] --- maven-surefire-plugin:2.9:test (test-phase-execution) @ syncope-core ---
[INFO] Surefire report directory: <http://jenkins.syncope-idm.org/job/Syncope%20trunk%20(GNU%20Linux)/org.syncope$syncope-core/ws/target/surefire-reports>

-------------------------------------------------------
 T E S T S
-------------------------------------------------------
Running org.syncope.core.persistence.dao.SchemaTest
Tests run: 7, Failures: 0, Errors: 0, Skipped: 0, Time elapsed: 8.73 sec
Running org.syncope.core.persistence.dao.ConnInstanceTest
Tests run: 4, Failures: 0, Errors: 0, Skipped: 0, Time elapsed: 0.057 sec
Running org.syncope.core.persistence.dao.PolicyTest
Tests run: 9, Failures: 0, Errors: 0, Skipped: 0, Time elapsed: 0.112 sec
Running org.syncope.core.persistence.dao.TaskTest
Tests run: 4, Failures: 0, Errors: 0, Skipped: 0, Time elapsed: 0.2 sec
Running org.syncope.core.persistence.dao.TaskExecTest
Tests run: 2, Failures: 0, Errors: 0, Skipped: 0, Time elapsed: 0.058 sec
Running org.syncope.core.persistence.dao.DerAttrTest
Tests run: 6, Failures: 0, Errors: 0, Skipped: 0, Time elapsed: 0.136 sec
Running org.syncope.core.persistence.dao.VirSchemaTest
Tests run: 4, Failures: 0, Errors: 0, Skipped: 0, Time elapsed: 0.049 sec
Running org.syncope.core.persistence.dao.RoleTest
Tests run: 8, Failures: 0, Errors: 0, Skipped: 0, Time elapsed: 0.214 sec
Running org.syncope.core.persistence.dao.VirAttrTest
Tests run: 6, Failures: 0, Errors: 0, Skipped: 0, Time elapsed: 0.097 sec
Running org.syncope.core.persistence.dao.EntitlementTest
Tests run: 4, Failures: 0, Errors: 0, Skipped: 0, Time elapsed: 0.113 sec
Running org.syncope.core.persistence.dao.DerSchemaTest
Tests run: 4, Failures: 0, Errors: 0, Skipped: 0, Time elapsed: 0.048 sec
Running org.syncope.core.persistence.dao.MembershipTest
Tests run: 4, Failures: 0, Errors: 0, Skipped: 0, Time elapsed: 0.087 sec
Running org.syncope.core.persistence.dao.ResourceTest
Tests run: 6, Failures: 0, Errors: 0, Skipped: 0, Time elapsed: 0.161 sec
Running org.syncope.core.persistence.dao.UserSearchTest
Tests run: 7, Failures: 0, Errors: 0, Skipped: 0, Time elapsed: 0.879 sec
Running org.syncope.core.persistence.dao.UserTest
Tests run: 11, Failures: 0, Errors: 0, Skipped: 0, Time elapsed: 0.551 sec
Running org.syncope.core.persistence.dao.AttrTest
Tests run: 7, Failures: 0, Errors: 0, Skipped: 0, Time elapsed: 5.011 sec
Running org.syncope.core.rest.data.ResourceDataBinderTest
Tests run: 2, Failures: 0, Errors: 0, Skipped: 0, Time elapsed: 0.323 sec
Running org.syncope.core.init.ConnInstanceLoaderTest
Tests run: 2, Failures: 0, Errors: 0, Skipped: 0, Time elapsed: 3.528 sec

Results :

Tests run: 97, Failures: 0, Errors: 0, Skipped: 0

[JENKINS] Recording test results
[INFO]
[INFO] --- maven-surefire-plugin:2.9:test (relationship-test-execution) @ syncope-core ---
[INFO] Surefire report directory: <http://jenkins.syncope-idm.org/job/Syncope%20trunk%20(GNU%20Linux)/org.syncope$syncope-core/ws/target/surefire-reports>

-------------------------------------------------------
 T E S T S
-------------------------------------------------------
Running org.syncope.core.persistence.relationships.SchemaTest
Tests run: 2, Failures: 0, Errors: 0, Skipped: 0, Time elapsed: 6.915 sec
Running org.syncope.core.persistence.relationships.TaskTest
Tests run: 6, Failures: 0, Errors: 0, Skipped: 0, Time elapsed: 0.265 sec
Running org.syncope.core.persistence.relationships.RoleTest
Tests run: 1, Failures: 0, Errors: 0, Skipped: 0, Time elapsed: 0.077 sec
Running org.syncope.core.persistence.relationships.DerSchemaTest
Tests run: 1, Failures: 0, Errors: 0, Skipped: 0, Time elapsed: 0.039 sec
Running org.syncope.core.persistence.relationships.MembershipTest
Tests run: 2, Failures: 0, Errors: 0, Skipped: 0, Time elapsed: 0.111 sec
Running org.syncope.core.persistence.relationships.ResourceTest
Tests run: 3, Failures: 0, Errors: 0, Skipped: 0, Time elapsed: 0.197 sec
Running org.syncope.core.persistence.relationships.UserTest
Tests run: 1, Failures: 0, Errors: 0, Skipped: 0, Time elapsed: 0.051 sec
Running org.syncope.core.persistence.relationships.AttrTest
Tests run: 3, Failures: 0, Errors: 0, Skipped: 0, Time elapsed: 0.094 sec

Results :

Tests run: 19, Failures: 0, Errors: 0, Skipped: 0

[JENKINS] Recording test results
[INFO]
[INFO] --- maven-war-plugin:2.1.1:war (default-war) @ syncope-core ---
[INFO] Packaging webapp
[INFO] Assembling webapp [syncope-core] in [<http://jenkins.syncope-idm.org/job/Syncope%20trunk%20(GNU%20Linux)/org.syncope$syncope-core/ws/target/syncope]>
[INFO] Processing war project
[INFO] Copying webapp webResources [<http://jenkins.syncope-idm.org/job/Syncope%20trunk%20(GNU%20Linux)/org.syncope$syncope-core/ws/src/main/webapp]> to [<http://jenkins.syncope-idm.org/job/Syncope%20trunk%20(GNU%20Linux)/org.syncope$syncope-core/ws/target/syncope]>
[INFO] Copying webapp resources [<http://jenkins.syncope-idm.org/job/Syncope%20trunk%20(GNU%20Linux)/org.syncope$syncope-core/ws/src/main/webapp]>
[INFO] Webapp assembled in [560 msecs]
[INFO] Building war: <http://jenkins.syncope-idm.org/job/Syncope%20trunk%20(GNU%20Linux)/org.syncope$syncope-core/ws/target/syncope.war>
[INFO] WEB-INF/web.xml already added, skipping
[INFO] Packaging classes
[INFO] Building jar: <http://jenkins.syncope-idm.org/job/Syncope%20trunk%20(GNU%20Linux)/org.syncope$syncope-core/ws/target/syncope-classes.jar>
[INFO]
[INFO] --- maven-antrun-plugin:1.6:run (explodeSyncopeWAR) @ syncope-core ---
[INFO] Executing tasks

main:
    [unzip] Expanding: <http://jenkins.syncope-idm.org/job/Syncope%20trunk%20(GNU%20Linux)/org.syncope$syncope-core/ws/target/syncope.war> into <http://jenkins.syncope-idm.org/job/Syncope%20trunk%20(GNU%20Linux)/org.syncope$syncope-core/ws/target/syncope-core-test>
[INFO] Executed tasks
[INFO]
[INFO] --- maven-antrun-plugin:1.6:run (setupTomcat) @ syncope-core ---
[INFO] Executing tasks

main:
      [get] Destination already exists (skipping): /tmp/apache-tomcat-7.0.22.zip
    [unzip] Expanding: /tmp/apache-tomcat-7.0.22.zip into /tmp
[INFO] Executed tasks
[INFO]
[INFO] --- maven-antrun-plugin:1.6:run (setupCSV) @ syncope-core ---
[INFO] Executing tasks

main:
     [copy] Copying 1 file to /tmp
[INFO] Executed tasks
[INFO]
[INFO] --- maven-hsqldb-plugin:1.0:run (startTestDb) @ syncope-core ---
[Server@14b5df44]: [Thread[pool-1-thread-1,5,main]]: setSilent(true)
[Server@14b5df44]: Initiating startup sequence...
[Server@14b5df44]: Server socket opened successfully in 1 ms.
[Server@14b5df44]: Database [index=0, id=0, db=mem:testdb, alias=testdb] opened sucessfully in 256 ms.
[Server@14b5df44]: Startup sequence completed in 259 ms.
[Server@14b5df44]: 2011-10-03 17:53:37.703 HSQLDB server 2.2.4 is online on port 9001
[Server@14b5df44]: To close normally, connect and execute SHUTDOWN SQL
[Server@14b5df44]: From command line, use [Ctrl]+[C] to abort abruptly
[INFO] HSQL Launched
[INFO] ONLINE
[INFO] Live name: testdb
[INFO]
[INFO] --- sql-maven-plugin:1.4:execute (loadTestDb) @ syncope-core ---
[INFO] Executing file: /tmp/testdb.1847319121sql
[INFO] 4 of 4 SQL statements executed successfully
[INFO]
[INFO] --- cargo-maven2-plugin:1.1.2:start (start-container) @ syncope-core ---
[INFO]
[INFO] --- maven-failsafe-plugin:2.9:integration-test (default) @ syncope-core ---
[INFO] Failsafe report directory: <http://jenkins.syncope-idm.org/job/Syncope%20trunk%20(GNU%20Linux)/org.syncope$syncope-core/ws/target/failsafe-reports>

-------------------------------------------------------
 T E S T S
-------------------------------------------------------
Running org.syncope.core.rest.TaskTestITCase
Tests run: 10, Failures: 2, Errors: 0, Skipped: 0, Time elapsed: 56.766 sec <<< FAILURE!
Running org.syncope.core.rest.AuthenticationTestITCase
Tests run: 4, Failures: 0, Errors: 0, Skipped: 0, Time elapsed: 1.365 sec
Running org.syncope.core.rest.UserTestITCase
Tests run: 21, Failures: 0, Errors: 2, Skipped: 0, Time elapsed: 5.322 sec <<< FAILURE!
Running org.syncope.core.rest.PolicyTestITCase
Tests run: 9, Failures: 0, Errors: 0, Skipped: 0, Time elapsed: 0.963 sec
Running org.syncope.core.rest.SchemaTestITCase
Tests run: 4, Failures: 0, Errors: 0, Skipped: 0, Time elapsed: 0.611 sec
Running org.syncope.core.rest.LogTestITCase
Tests run: 1, Failures: 0, Errors: 0, Skipped: 0, Time elapsed: 0.122 sec
Running org.syncope.core.rest.ConfigurationTestITCase
Tests run: 5, Failures: 0, Errors: 0, Skipped: 0, Time elapsed: 0.622 sec
Running org.syncope.core.rest.DerivedSchemaTestITCase
Tests run: 5, Failures: 0, Errors: 0, Skipped: 0, Time elapsed: 0.43 sec
Running org.syncope.core.rest.RoleTestITCase
Tests run: 10, Failures: 0, Errors: 0, Skipped: 0, Time elapsed: 0.834 sec
Running org.syncope.core.rest.ResourceTestITCase
Tests run: 13, Failures: 0, Errors: 0, Skipped: 0, Time elapsed: 1.466 sec
Running org.syncope.core.rest.ConnInstanceTestITCase
Tests run: 10, Failures: 0, Errors: 1, Skipped: 0, Time elapsed: 0.674 sec <<< FAILURE!
Running org.syncope.core.rest.VirtualSchemaTestITCase
Tests run: 4, Failures: 0, Errors: 0, Skipped: 0, Time elapsed: 0.199 sec

Results :

Failed tests:   sync(org.syncope.core.rest.TaskTestITCase): Expected 410, found 4
  deal(org.syncope.core.rest.TaskTestITCase): expected:<[]SUBMITTED> but was:<[UN]SUBMITTED>

Tests in error:
  create(org.syncope.core.rest.UserTestITCase): {[Propagation [ws-target-resource-2]], }
  verifyTaskRegistration(org.syncope.core.rest.UserTestITCase): {[Propagation [ws-target-resource-2]], }
  getSchemaNames(org.syncope.core.rest.ConnInstanceTestITCase): 500 Internal Server Error

Tests run: 96, Failures: 2, Errors: 3, Skipped: 0

[JENKINS] Recording test results
[INFO]
[INFO] --- cargo-maven2-plugin:1.1.2:stop (stop-container) @ syncope-core ---
[INFO]
[INFO] Failsafe report directory: <http://jenkins.syncope-idm.org/job/Syncope%20trunk%20(GNU%20Linux)/org.syncope$syncope-core/ws/target/failsafe-reports>
[INFO] --- maven-failsafe-plugin:2.9:verify (default) @ syncope-core ---
[JENKINS] Archiving <http://jenkins.syncope-idm.org/job/Syncope%20trunk%20(GNU%20Linux)/org.syncope$syncope-core/ws/pom.xml> to /var/lib/jenkins/jobs/Syncope trunk (GNU Linux)/modules/org.syncope$syncope-core/builds/2011-10-03_17-51-25/archive/org.syncope/syncope-core/0.7-SNAPSHOT/syncope-core-0.7-SNAPSHOT.pom
[JENKINS] Archiving <http://jenkins.syncope-idm.org/job/Syncope%20trunk%20(GNU%20Linux)/org.syncope$syncope-core/ws/target/syncope.war> to /var/lib/jenkins/jobs/Syncope trunk (GNU Linux)/modules/org.syncope$syncope-core/builds/2011-10-03_17-51-25/archive/org.syncope/syncope-core/0.7-SNAPSHOT/syncope-core-0.7-SNAPSHOT.war
[JENKINS] Archiving <http://jenkins.syncope-idm.org/job/Syncope%20trunk%20(GNU%20Linux)/org.syncope$syncope-core/ws/target/syncope-classes.jar> to /var/lib/jenkins/jobs/Syncope trunk (GNU Linux)/modules/org.syncope$syncope-core/builds/2011-10-03_17-51-25/archive/org.syncope/syncope-core/0.7-SNAPSHOT/syncope-core-0.7-SNAPSHOT-classes.jar

Reply | Threaded
Open this post in threaded view
|

[syncope-dev] Jenkins build is back to normal : Syncope trunk (GNU Linux) » Syncope core #47

jenkins