[syncope-dev] Build failed in Jenkins: Syncope trunk (GNU Linux) » Syncope core #40

classic Classic list List threaded Threaded
4 messages Options
Reply | Threaded
Open this post in threaded view
|

[syncope-dev] Build failed in Jenkins: Syncope trunk (GNU Linux) » Syncope core #40

jenkins
See <http://jenkins.syncope-idm.org/job/Syncope%20trunk%20(GNU%20Linux)/org.syncope$syncope-core/40/changes>

Changes:

[[hidden email]] Into ConnInstanceLoader I modified properties overriding to correct a little bug about skipping existing properties.
I made some modification into the console: overridden property is required if property schema is required.
Further, bean registration is required just for resources. Schema names retrieving is performed just instantiating a ConnectorFacadeProxy ad-hoc.

Fixes issue 153

------------------------------------------
[INFO]                                                                        
[INFO] ------------------------------------------------------------------------
[INFO] Building Syncope core 0.7-SNAPSHOT
[INFO] ------------------------------------------------------------------------
Downloading: http://repo1.maven.org/maven2/org/mockito/mockito-core/1.8.5/mockito-core-1.8.5.pom
Downloaded: http://repo1.maven.org/maven2/org/mockito/mockito-core/1.8.5/mockito-core-1.8.5.pom (2 KB at 1.8 KB/sec)
Downloading: http://repo1.maven.org/maven2/org/objenesis/objenesis/1.0/objenesis-1.0.pom
Downloaded: http://repo1.maven.org/maven2/org/objenesis/objenesis/1.0/objenesis-1.0.pom (853 B at 1.8 KB/sec)
Downloading: http://repo1.maven.org/maven2/org/mockito/mockito-core/1.8.5/mockito-core-1.8.5.jar
Downloading: http://repo1.maven.org/maven2/org/objenesis/objenesis/1.0/objenesis-1.0.jar
Downloaded: http://repo1.maven.org/maven2/org/objenesis/objenesis/1.0/objenesis-1.0.jar (28 KB at 45.8 KB/sec)
Downloaded: http://repo1.maven.org/maven2/org/mockito/mockito-core/1.8.5/mockito-core-1.8.5.jar (1308 KB at 457.1 KB/sec)
[INFO]
[INFO] --- maven-clean-plugin:2.4.1:clean (default-clean) @ syncope-core ---
[INFO]
[INFO] --- maven-enforcer-plugin:1.0:enforce (enforce-maven) @ syncope-core ---
[INFO]
[INFO] --- syncope-build-tools:0.7-SNAPSHOT:set-dynamic-properties (set-dynamic-properties) @ syncope-core ---
[INFO]
[INFO] --- maven-resources-plugin:2.5:resources (default-resources) @ syncope-core ---
[debug] execute contextualize
[INFO] Using 'UTF-8' encoding to copy filtered resources.
[INFO] Copying 27 resources
[INFO]
[INFO] --- maven-compiler-plugin:2.3.2:compile (default-compile) @ syncope-core ---
[INFO] Compiling 205 source files to <http://jenkins.syncope-idm.org/job/Syncope%20trunk%20(GNU%20Linux)/org.syncope$syncope-core/ws/target/classes>
[INFO]
[debug] execute contextualize
[INFO] --- maven-resources-plugin:2.5:testResources (default-testResources) @ syncope-core ---
[INFO] Using 'UTF-8' encoding to copy filtered resources.
[INFO] Copying 11 resources
[INFO]
[INFO] --- maven-compiler-plugin:2.3.2:testCompile (default-testCompile) @ syncope-core ---
[INFO] Compiling 42 source files to <http://jenkins.syncope-idm.org/job/Syncope%20trunk%20(GNU%20Linux)/org.syncope$syncope-core/ws/target/test-classes>
[INFO]
[INFO] --- maven-surefire-plugin:2.9:test (default-test) @ syncope-core ---
[INFO] Tests are skipped.
[INFO]
[INFO] --- maven-surefire-plugin:2.9:test (test-phase-execution) @ syncope-core ---
[INFO] Surefire report directory: <http://jenkins.syncope-idm.org/job/Syncope%20trunk%20(GNU%20Linux)/org.syncope$syncope-core/ws/target/surefire-reports>

-------------------------------------------------------
 T E S T S
-------------------------------------------------------
Running jpasymphony.dao.JPAWorkflowEntryTest
Tests run: 1, Failures: 0, Errors: 0, Skipped: 0, Time elapsed: 8.585 sec
Running org.syncope.core.persistence.dao.SchemaTest
Tests run: 7, Failures: 0, Errors: 0, Skipped: 0, Time elapsed: 0.277 sec
Running org.syncope.core.persistence.dao.ConnInstanceTest
Tests run: 4, Failures: 0, Errors: 0, Skipped: 0, Time elapsed: 0.057 sec
Running org.syncope.core.persistence.dao.PolicyTest
Tests run: 9, Failures: 0, Errors: 0, Skipped: 0, Time elapsed: 0.103 sec
Running org.syncope.core.persistence.dao.TaskTest
Tests run: 4, Failures: 0, Errors: 0, Skipped: 0, Time elapsed: 0.727 sec
Running org.syncope.core.persistence.dao.TaskExecTest
Tests run: 2, Failures: 0, Errors: 0, Skipped: 0, Time elapsed: 0.061 sec
Running org.syncope.core.persistence.dao.DerAttrTest
Tests run: 6, Failures: 0, Errors: 0, Skipped: 0, Time elapsed: 0.14 sec
Running org.syncope.core.persistence.dao.VirSchemaTest
Tests run: 4, Failures: 0, Errors: 0, Skipped: 0, Time elapsed: 0.047 sec
Running org.syncope.core.persistence.dao.RoleTest
Tests run: 8, Failures: 0, Errors: 0, Skipped: 0, Time elapsed: 0.213 sec
Running org.syncope.core.persistence.dao.VirAttrTest
Tests run: 6, Failures: 0, Errors: 0, Skipped: 0, Time elapsed: 0.102 sec
Running org.syncope.core.persistence.dao.EntitlementTest
Tests run: 4, Failures: 0, Errors: 0, Skipped: 0, Time elapsed: 0.104 sec
Running org.syncope.core.persistence.dao.DerSchemaTest
Tests run: 4, Failures: 0, Errors: 0, Skipped: 0, Time elapsed: 0.045 sec
Running org.syncope.core.persistence.dao.MembershipTest
Tests run: 4, Failures: 0, Errors: 0, Skipped: 0, Time elapsed: 0.098 sec
Running org.syncope.core.persistence.dao.ResourceTest
Tests run: 6, Failures: 0, Errors: 0, Skipped: 0, Time elapsed: 0.131 sec
Running org.syncope.core.persistence.dao.UserSearchTest
Tests run: 7, Failures: 0, Errors: 0, Skipped: 0, Time elapsed: 0.513 sec
Running org.syncope.core.persistence.dao.UserTest
Tests run: 11, Failures: 0, Errors: 0, Skipped: 0, Time elapsed: 0.303 sec
Running org.syncope.core.persistence.dao.AttrTest
Tests run: 7, Failures: 0, Errors: 0, Skipped: 0, Time elapsed: 0.112 sec

Results :

Tests run: 94, Failures: 0, Errors: 0, Skipped: 0

[JENKINS] Recording test results
[INFO]
[INFO] --- maven-surefire-plugin:2.9:test (relationship-test-execution) @ syncope-core ---
[INFO] Surefire report directory: <http://jenkins.syncope-idm.org/job/Syncope%20trunk%20(GNU%20Linux)/org.syncope$syncope-core/ws/target/surefire-reports>

-------------------------------------------------------
 T E S T S
-------------------------------------------------------
Running jpasymphony.relationships.JPAWorkflowEntryTest
Tests run: 1, Failures: 0, Errors: 0, Skipped: 0, Time elapsed: 6.674 sec
Running org.syncope.core.persistence.relationships.SchemaTest
Tests run: 2, Failures: 0, Errors: 0, Skipped: 0, Time elapsed: 0.206 sec
Running org.syncope.core.persistence.relationships.TaskTest
Tests run: 6, Failures: 0, Errors: 0, Skipped: 0, Time elapsed: 0.496 sec
Running org.syncope.core.persistence.relationships.RoleTest
Tests run: 1, Failures: 0, Errors: 0, Skipped: 0, Time elapsed: 0.084 sec
Running org.syncope.core.persistence.relationships.DerSchemaTest
Tests run: 1, Failures: 0, Errors: 0, Skipped: 0, Time elapsed: 0.042 sec
Running org.syncope.core.persistence.relationships.MembershipTest
Tests run: 2, Failures: 0, Errors: 0, Skipped: 0, Time elapsed: 0.115 sec
Running org.syncope.core.persistence.relationships.ResourceTest
Tests run: 3, Failures: 0, Errors: 0, Skipped: 0, Time elapsed: 0.219 sec
Running org.syncope.core.persistence.relationships.UserTest
Tests run: 1, Failures: 0, Errors: 0, Skipped: 0, Time elapsed: 0.071 sec
Running org.syncope.core.persistence.relationships.AttrTest
Tests run: 3, Failures: 0, Errors: 0, Skipped: 0, Time elapsed: 0.092 sec

Results :

Tests run: 20, Failures: 0, Errors: 0, Skipped: 0

[JENKINS] Recording test results
[INFO]
[INFO] --- maven-war-plugin:2.1.1:war (default-war) @ syncope-core ---
[INFO] Packaging webapp
[INFO] Assembling webapp [syncope-core] in [<http://jenkins.syncope-idm.org/job/Syncope%20trunk%20(GNU%20Linux)/org.syncope$syncope-core/ws/target/syncope]>
[INFO] Processing war project
[INFO] Copying webapp webResources [<http://jenkins.syncope-idm.org/job/Syncope%20trunk%20(GNU%20Linux)/org.syncope$syncope-core/ws/src/main/webapp]> to [<http://jenkins.syncope-idm.org/job/Syncope%20trunk%20(GNU%20Linux)/org.syncope$syncope-core/ws/target/syncope]>
[INFO] Copying webapp resources [<http://jenkins.syncope-idm.org/job/Syncope%20trunk%20(GNU%20Linux)/org.syncope$syncope-core/ws/src/main/webapp]>
[INFO] Webapp assembled in [509 msecs]
[INFO] Building war: <http://jenkins.syncope-idm.org/job/Syncope%20trunk%20(GNU%20Linux)/org.syncope$syncope-core/ws/target/syncope.war>
[INFO] WEB-INF/web.xml already added, skipping
[INFO] Packaging classes
[INFO] Building jar: <http://jenkins.syncope-idm.org/job/Syncope%20trunk%20(GNU%20Linux)/org.syncope$syncope-core/ws/target/syncope-classes.jar>
[INFO]
[INFO] --- maven-antrun-plugin:1.6:run (explodeSyncopeWAR) @ syncope-core ---
[INFO] Executing tasks

main:
    [unzip] Expanding: <http://jenkins.syncope-idm.org/job/Syncope%20trunk%20(GNU%20Linux)/org.syncope$syncope-core/ws/target/syncope.war> into <http://jenkins.syncope-idm.org/job/Syncope%20trunk%20(GNU%20Linux)/org.syncope$syncope-core/ws/target/syncope-core-test>
[INFO] Executed tasks
[INFO]
[INFO] --- maven-antrun-plugin:1.6:run (setupTomcat) @ syncope-core ---
[INFO] Executing tasks

main:
      [get] Destination already exists (skipping): /tmp/apache-tomcat-7.0.21.zip
    [unzip] Expanding: /tmp/apache-tomcat-7.0.21.zip into /tmp
[INFO] Executed tasks
[INFO]
[INFO] --- maven-antrun-plugin:1.6:run (setupCSV) @ syncope-core ---
[INFO] Executing tasks

main:
     [copy] Copying 1 file to /tmp
[INFO] Executed tasks
[INFO]
[INFO] --- maven-dependency-plugin:2.3:copy (set-bundles) @ syncope-core ---
[INFO] Configured Artifact: org.connid.bundles.soap:org.connid.bundles.soap:1.1:jar
[INFO] Configured Artifact: org.connid.bundles.db:org.connid.bundles.db.table:1.2.1:jar
[INFO] Configured Artifact: org.connid.bundles:org.connid.bundles.csvdir:0.1:jar
[INFO] Copying org.connid.bundles.soap-1.1.jar to <http://jenkins.syncope-idm.org/job/Syncope%20trunk%20(GNU%20Linux)/org.syncope$syncope-core/ws/target/bundles/org.connid.bundles.soap-1.1.jar>
[INFO] Copying org.connid.bundles.db.table-1.2.1.jar to <http://jenkins.syncope-idm.org/job/Syncope%20trunk%20(GNU%20Linux)/org.syncope$syncope-core/ws/target/bundles/org.connid.bundles.db.table-1.2.1.jar>
[INFO] Copying org.connid.bundles.csvdir-0.1.jar to <http://jenkins.syncope-idm.org/job/Syncope%20trunk%20(GNU%20Linux)/org.syncope$syncope-core/ws/target/bundles/org.connid.bundles.csvdir-0.1.jar>
[INFO]
[INFO] --- maven-hsqldb-plugin:1.0:run (startTestDb) @ syncope-core ---
[Server@1e0e0228]: [Thread[pool-1-thread-1,5,main]]: setSilent(true)
[Server@1e0e0228]: Initiating startup sequence...
[Server@1e0e0228]: Server socket opened successfully in 1 ms.
[Server@1e0e0228]: Database [index=0, id=0, db=mem:testdb, alias=testdb] opened sucessfully in 241 ms.
[Server@1e0e0228]: Startup sequence completed in 244 ms.
[Server@1e0e0228]: 2011-09-23 17:23:28.400 HSQLDB server 2.2.4 is online on port 9001
[Server@1e0e0228]: To close normally, connect and execute SHUTDOWN SQL
[Server@1e0e0228]: From command line, use [Ctrl]+[C] to abort abruptly
[INFO] HSQL Launched
[INFO] ONLINE
[INFO] Live name: testdb
[INFO]
[INFO] --- sql-maven-plugin:1.4:execute (loadTestDb) @ syncope-core ---
[INFO] Executing file: /tmp/testdb.18691549sql
[INFO] 4 of 4 SQL statements executed successfully
[INFO]
[INFO] --- cargo-maven2-plugin:1.1.2:start (start-container) @ syncope-core ---
[INFO]
[INFO] --- maven-failsafe-plugin:2.9:integration-test (default) @ syncope-core ---
[INFO] Failsafe report directory: <http://jenkins.syncope-idm.org/job/Syncope%20trunk%20(GNU%20Linux)/org.syncope$syncope-core/ws/target/failsafe-reports>

-------------------------------------------------------
 T E S T S
-------------------------------------------------------
Running org.syncope.core.rest.TaskTestITCase
Tests run: 10, Failures: 0, Errors: 0, Skipped: 0, Time elapsed: 39.539 sec
Running org.syncope.core.rest.AuthenticationTestITCase
Tests run: 4, Failures: 0, Errors: 0, Skipped: 0, Time elapsed: 1.909 sec
Running org.syncope.core.rest.UserTestITCase
Tests run: 22, Failures: 0, Errors: 0, Skipped: 0, Time elapsed: 5.821 sec
Running org.syncope.core.rest.PolicyTestITCase
Tests run: 9, Failures: 0, Errors: 0, Skipped: 0, Time elapsed: 0.63 sec
Running org.syncope.core.rest.SchemaTestITCase
Tests run: 4, Failures: 0, Errors: 0, Skipped: 0, Time elapsed: 0.479 sec
Running org.syncope.core.rest.LogTestITCase
Tests run: 1, Failures: 0, Errors: 0, Skipped: 0, Time elapsed: 0.097 sec
Running org.syncope.core.rest.ConfigurationTestITCase
Tests run: 5, Failures: 0, Errors: 0, Skipped: 0, Time elapsed: 0.325 sec
Running org.syncope.core.rest.DerivedSchemaTestITCase
Tests run: 5, Failures: 0, Errors: 0, Skipped: 0, Time elapsed: 0.346 sec
Running org.syncope.core.rest.RoleTestITCase
Tests run: 10, Failures: 0, Errors: 0, Skipped: 0, Time elapsed: 0.624 sec
Running org.syncope.core.rest.ResourceTestITCase
Tests run: 13, Failures: 0, Errors: 0, Skipped: 0, Time elapsed: 0.715 sec
Running org.syncope.core.rest.ConnInstanceTestITCase
Tests run: 10, Failures: 0, Errors: 2, Skipped: 0, Time elapsed: 0.565 sec <<< FAILURE!
Running org.syncope.core.rest.VirtualSchemaTestITCase
Tests run: 4, Failures: 0, Errors: 0, Skipped: 0, Time elapsed: 0.223 sec

Results :

Tests in error:
  check(org.syncope.core.rest.ConnInstanceTestITCase): {[NotFound [Resource 'ws-target-resource-1']], }
  getSchemaNames(org.syncope.core.rest.ConnInstanceTestITCase): {[NotFound [Resource 'ws-target-resource-1']], }

[JENKINS] Recording test resultsTests run: 97, Failures: 0, Errors: 2, Skipped: 0


[INFO]
[INFO] --- cargo-maven2-plugin:1.1.2:stop (stop-container) @ syncope-core ---
[INFO]
[INFO] Failsafe report directory: <http://jenkins.syncope-idm.org/job/Syncope%20trunk%20(GNU%20Linux)/org.syncope$syncope-core/ws/target/failsafe-reports>
[INFO] --- maven-failsafe-plugin:2.9:verify (default) @ syncope-core ---
[JENKINS] Archiving <http://jenkins.syncope-idm.org/job/Syncope%20trunk%20(GNU%20Linux)/org.syncope$syncope-core/ws/pom.xml> to /var/lib/jenkins/jobs/Syncope trunk (GNU Linux)/modules/org.syncope$syncope-core/builds/2011-09-23_17-21-33/archive/org.syncope/syncope-core/0.7-SNAPSHOT/syncope-core-0.7-SNAPSHOT.pom
[JENKINS] Archiving <http://jenkins.syncope-idm.org/job/Syncope%20trunk%20(GNU%20Linux)/org.syncope$syncope-core/ws/target/syncope.war> to /var/lib/jenkins/jobs/Syncope trunk (GNU Linux)/modules/org.syncope$syncope-core/builds/2011-09-23_17-21-33/archive/org.syncope/syncope-core/0.7-SNAPSHOT/syncope-core-0.7-SNAPSHOT.war
[JENKINS] Archiving <http://jenkins.syncope-idm.org/job/Syncope%20trunk%20(GNU%20Linux)/org.syncope$syncope-core/ws/target/syncope-classes.jar> to /var/lib/jenkins/jobs/Syncope trunk (GNU Linux)/modules/org.syncope$syncope-core/builds/2011-09-23_17-21-33/archive/org.syncope/syncope-core/0.7-SNAPSHOT/syncope-core-0.7-SNAPSHOT-classes.jar

Reply | Threaded
Open this post in threaded view
|

[syncope-dev] Build failed in Jenkins: Syncope trunk (GNU Linux) » Syncope core #41

jenkins
See <http://jenkins.syncope-idm.org/job/Syncope%20trunk%20(GNU%20Linux)/org.syncope$syncope-core/41/>

------------------------------------------
[INFO]                                                                        
[INFO] ------------------------------------------------------------------------
[INFO] Building Syncope core 0.7-SNAPSHOT
[INFO] ------------------------------------------------------------------------
[INFO]
[INFO] --- maven-clean-plugin:2.4.1:clean (default-clean) @ syncope-core ---
[INFO]
[INFO] --- maven-enforcer-plugin:1.0:enforce (enforce-maven) @ syncope-core ---
[INFO]
[INFO] --- syncope-build-tools:0.7-SNAPSHOT:set-dynamic-properties (set-dynamic-properties) @ syncope-core ---
[INFO]
[INFO] --- maven-resources-plugin:2.5:resources (default-resources) @ syncope-core ---
[debug] execute contextualize
[INFO] Using 'UTF-8' encoding to copy filtered resources.
[INFO] Copying 27 resources
[INFO]
[INFO] --- maven-compiler-plugin:2.3.2:compile (default-compile) @ syncope-core ---
[INFO] Compiling 205 source files to <http://jenkins.syncope-idm.org/job/Syncope%20trunk%20(GNU%20Linux)/org.syncope$syncope-core/ws/target/classes>
[INFO]
[INFO] --- maven-resources-plugin:2.5:testResources (default-testResources) @ syncope-core ---
[debug] execute contextualize
[INFO] Using 'UTF-8' encoding to copy filtered resources.
[INFO] Copying 11 resources
[INFO]
[INFO] --- maven-compiler-plugin:2.3.2:testCompile (default-testCompile) @ syncope-core ---
[INFO] Compiling 42 source files to <http://jenkins.syncope-idm.org/job/Syncope%20trunk%20(GNU%20Linux)/org.syncope$syncope-core/ws/target/test-classes>
[INFO]
[INFO] --- maven-surefire-plugin:2.9:test (default-test) @ syncope-core ---
[INFO] Tests are skipped.
[INFO]
[INFO] --- maven-surefire-plugin:2.9:test (test-phase-execution) @ syncope-core ---
[INFO] Surefire report directory: <http://jenkins.syncope-idm.org/job/Syncope%20trunk%20(GNU%20Linux)/org.syncope$syncope-core/ws/target/surefire-reports>

-------------------------------------------------------
 T E S T S
-------------------------------------------------------
Running jpasymphony.dao.JPAWorkflowEntryTest
Tests run: 1, Failures: 0, Errors: 0, Skipped: 0, Time elapsed: 6.742 sec
Running org.syncope.core.persistence.dao.SchemaTest
Tests run: 7, Failures: 0, Errors: 0, Skipped: 0, Time elapsed: 0.265 sec
Running org.syncope.core.persistence.dao.ConnInstanceTest
Tests run: 4, Failures: 0, Errors: 0, Skipped: 0, Time elapsed: 0.061 sec
Running org.syncope.core.persistence.dao.PolicyTest
Tests run: 9, Failures: 0, Errors: 0, Skipped: 0, Time elapsed: 0.115 sec
Running org.syncope.core.persistence.dao.TaskTest
Tests run: 4, Failures: 0, Errors: 0, Skipped: 0, Time elapsed: 0.513 sec
Running org.syncope.core.persistence.dao.TaskExecTest
Tests run: 2, Failures: 0, Errors: 0, Skipped: 0, Time elapsed: 0.061 sec
Running org.syncope.core.persistence.dao.DerAttrTest
Tests run: 6, Failures: 0, Errors: 0, Skipped: 0, Time elapsed: 0.139 sec
Running org.syncope.core.persistence.dao.VirSchemaTest
Tests run: 4, Failures: 0, Errors: 0, Skipped: 0, Time elapsed: 0.05 sec
Running org.syncope.core.persistence.dao.RoleTest
Tests run: 8, Failures: 0, Errors: 0, Skipped: 0, Time elapsed: 0.215 sec
Running org.syncope.core.persistence.dao.VirAttrTest
Tests run: 6, Failures: 0, Errors: 0, Skipped: 0, Time elapsed: 0.104 sec
Running org.syncope.core.persistence.dao.EntitlementTest
Tests run: 4, Failures: 0, Errors: 0, Skipped: 0, Time elapsed: 0.103 sec
Running org.syncope.core.persistence.dao.DerSchemaTest
Tests run: 4, Failures: 0, Errors: 0, Skipped: 0, Time elapsed: 0.044 sec
Running org.syncope.core.persistence.dao.MembershipTest
Tests run: 4, Failures: 0, Errors: 0, Skipped: 0, Time elapsed: 0.111 sec
Running org.syncope.core.persistence.dao.ResourceTest
Tests run: 6, Failures: 0, Errors: 0, Skipped: 0, Time elapsed: 0.127 sec
Running org.syncope.core.persistence.dao.UserSearchTest
Tests run: 7, Failures: 0, Errors: 0, Skipped: 0, Time elapsed: 0.506 sec
Running org.syncope.core.persistence.dao.UserTest
Tests run: 11, Failures: 0, Errors: 0, Skipped: 0, Time elapsed: 0.312 sec
Running org.syncope.core.persistence.dao.AttrTest
Tests run: 7, Failures: 0, Errors: 0, Skipped: 0, Time elapsed: 0.11 sec

Results :

Tests run: 94, Failures: 0, Errors: 0, Skipped: 0

[JENKINS] Recording test results
[INFO]
[INFO] --- maven-surefire-plugin:2.9:test (relationship-test-execution) @ syncope-core ---
[INFO] Surefire report directory: <http://jenkins.syncope-idm.org/job/Syncope%20trunk%20(GNU%20Linux)/org.syncope$syncope-core/ws/target/surefire-reports>

-------------------------------------------------------
 T E S T S
-------------------------------------------------------
Running jpasymphony.relationships.JPAWorkflowEntryTest
Tests run: 1, Failures: 0, Errors: 0, Skipped: 0, Time elapsed: 6.375 sec
Running org.syncope.core.persistence.relationships.SchemaTest
Tests run: 2, Failures: 0, Errors: 0, Skipped: 0, Time elapsed: 0.235 sec
Running org.syncope.core.persistence.relationships.TaskTest
Tests run: 6, Failures: 0, Errors: 0, Skipped: 0, Time elapsed: 0.531 sec
Running org.syncope.core.persistence.relationships.RoleTest
Tests run: 1, Failures: 0, Errors: 0, Skipped: 0, Time elapsed: 0.075 sec
Running org.syncope.core.persistence.relationships.DerSchemaTest
Tests run: 1, Failures: 0, Errors: 0, Skipped: 0, Time elapsed: 0.039 sec
Running org.syncope.core.persistence.relationships.MembershipTest
Tests run: 2, Failures: 0, Errors: 0, Skipped: 0, Time elapsed: 0.11 sec
Running org.syncope.core.persistence.relationships.ResourceTest
Tests run: 3, Failures: 0, Errors: 0, Skipped: 0, Time elapsed: 0.188 sec
Running org.syncope.core.persistence.relationships.UserTest
Tests run: 1, Failures: 0, Errors: 0, Skipped: 0, Time elapsed: 0.052 sec
Running org.syncope.core.persistence.relationships.AttrTest
Tests run: 3, Failures: 0, Errors: 0, Skipped: 0, Time elapsed: 0.092 sec

Results :

Tests run: 20, Failures: 0, Errors: 0, Skipped: 0

[JENKINS] Recording test results
[INFO]
[INFO] --- maven-war-plugin:2.1.1:war (default-war) @ syncope-core ---
[INFO] Packaging webapp
[INFO] Assembling webapp [syncope-core] in [<http://jenkins.syncope-idm.org/job/Syncope%20trunk%20(GNU%20Linux)/org.syncope$syncope-core/ws/target/syncope]>
[INFO] Processing war project
[INFO] Copying webapp webResources [<http://jenkins.syncope-idm.org/job/Syncope%20trunk%20(GNU%20Linux)/org.syncope$syncope-core/ws/src/main/webapp]> to [<http://jenkins.syncope-idm.org/job/Syncope%20trunk%20(GNU%20Linux)/org.syncope$syncope-core/ws/target/syncope]>
[INFO] Copying webapp resources [<http://jenkins.syncope-idm.org/job/Syncope%20trunk%20(GNU%20Linux)/org.syncope$syncope-core/ws/src/main/webapp]>
[INFO] Webapp assembled in [283 msecs]
[INFO] Building war: <http://jenkins.syncope-idm.org/job/Syncope%20trunk%20(GNU%20Linux)/org.syncope$syncope-core/ws/target/syncope.war>
[INFO] WEB-INF/web.xml already added, skipping
[INFO] Packaging classes
[INFO] Building jar: <http://jenkins.syncope-idm.org/job/Syncope%20trunk%20(GNU%20Linux)/org.syncope$syncope-core/ws/target/syncope-classes.jar>
[INFO]
[INFO] --- maven-antrun-plugin:1.6:run (explodeSyncopeWAR) @ syncope-core ---
[INFO] Executing tasks

main:
    [unzip] Expanding: <http://jenkins.syncope-idm.org/job/Syncope%20trunk%20(GNU%20Linux)/org.syncope$syncope-core/ws/target/syncope.war> into <http://jenkins.syncope-idm.org/job/Syncope%20trunk%20(GNU%20Linux)/org.syncope$syncope-core/ws/target/syncope-core-test>
[INFO] Executed tasks
[INFO]
[INFO] --- maven-antrun-plugin:1.6:run (setupTomcat) @ syncope-core ---
[INFO] Executing tasks

main:
      [get] Destination already exists (skipping): /tmp/apache-tomcat-7.0.21.zip
    [unzip] Expanding: /tmp/apache-tomcat-7.0.21.zip into /tmp
[INFO] Executed tasks
[INFO]
[INFO] --- maven-antrun-plugin:1.6:run (setupCSV) @ syncope-core ---
[INFO] Executing tasks

main:
     [copy] Copying 1 file to /tmp
[INFO] Executed tasks
[INFO]
[INFO] --- maven-dependency-plugin:2.3:copy (set-bundles) @ syncope-core ---
[INFO] Configured Artifact: org.connid.bundles.soap:org.connid.bundles.soap:1.1:jar
[INFO] Configured Artifact: org.connid.bundles.db:org.connid.bundles.db.table:1.2.1:jar
[INFO] Configured Artifact: org.connid.bundles:org.connid.bundles.csvdir:0.1:jar
[INFO] Copying org.connid.bundles.soap-1.1.jar to <http://jenkins.syncope-idm.org/job/Syncope%20trunk%20(GNU%20Linux)/org.syncope$syncope-core/ws/target/bundles/org.connid.bundles.soap-1.1.jar>
[INFO] Copying org.connid.bundles.db.table-1.2.1.jar to <http://jenkins.syncope-idm.org/job/Syncope%20trunk%20(GNU%20Linux)/org.syncope$syncope-core/ws/target/bundles/org.connid.bundles.db.table-1.2.1.jar>
[INFO] Copying org.connid.bundles.csvdir-0.1.jar to <http://jenkins.syncope-idm.org/job/Syncope%20trunk%20(GNU%20Linux)/org.syncope$syncope-core/ws/target/bundles/org.connid.bundles.csvdir-0.1.jar>
[INFO]
[INFO] --- maven-hsqldb-plugin:1.0:run (startTestDb) @ syncope-core ---
[Server@52f64abf]: [Thread[pool-1-thread-1,5,main]]: setSilent(true)
[Server@52f64abf]: Initiating startup sequence...
[Server@52f64abf]: Server socket opened successfully in 1 ms.
[Server@52f64abf]: Database [index=0, id=0, db=mem:testdb, alias=testdb] opened sucessfully in 254 ms.
[Server@52f64abf]: Startup sequence completed in 257 ms.
[Server@52f64abf]: 2011-09-23 17:36:34.629 HSQLDB server 2.2.4 is online on port 9001
[Server@52f64abf]: To close normally, connect and execute SHUTDOWN SQL
[Server@52f64abf]: From command line, use [Ctrl]+[C] to abort abruptly
[INFO] HSQL Launched
[INFO] ONLINE
[INFO] Live name: testdb
[INFO]
[INFO] --- sql-maven-plugin:1.4:execute (loadTestDb) @ syncope-core ---
[INFO] Executing file: /tmp/testdb.1379006994sql
[INFO] 4 of 4 SQL statements executed successfully
[INFO]
[INFO] --- cargo-maven2-plugin:1.1.2:start (start-container) @ syncope-core ---
[INFO]
[INFO] --- maven-failsafe-plugin:2.9:integration-test (default) @ syncope-core ---
[INFO] Failsafe report directory: <http://jenkins.syncope-idm.org/job/Syncope%20trunk%20(GNU%20Linux)/org.syncope$syncope-core/ws/target/failsafe-reports>

-------------------------------------------------------
 T E S T S
-------------------------------------------------------
Running org.syncope.core.rest.TaskTestITCase
Tests run: 10, Failures: 0, Errors: 0, Skipped: 0, Time elapsed: 20.485 sec
Running org.syncope.core.rest.AuthenticationTestITCase
Tests run: 4, Failures: 0, Errors: 0, Skipped: 0, Time elapsed: 1.386 sec
Running org.syncope.core.rest.UserTestITCase
Tests run: 22, Failures: 0, Errors: 0, Skipped: 0, Time elapsed: 5.223 sec
Running org.syncope.core.rest.PolicyTestITCase
Tests run: 9, Failures: 0, Errors: 0, Skipped: 0, Time elapsed: 0.593 sec
Running org.syncope.core.rest.SchemaTestITCase
Tests run: 4, Failures: 0, Errors: 0, Skipped: 0, Time elapsed: 0.425 sec
Running org.syncope.core.rest.LogTestITCase
Tests run: 1, Failures: 0, Errors: 0, Skipped: 0, Time elapsed: 0.046 sec
Running org.syncope.core.rest.ConfigurationTestITCase
Tests run: 5, Failures: 0, Errors: 0, Skipped: 0, Time elapsed: 0.262 sec
Running org.syncope.core.rest.DerivedSchemaTestITCase
Tests run: 5, Failures: 0, Errors: 0, Skipped: 0, Time elapsed: 0.277 sec
Running org.syncope.core.rest.RoleTestITCase
Tests run: 10, Failures: 0, Errors: 0, Skipped: 0, Time elapsed: 0.545 sec
Running org.syncope.core.rest.ResourceTestITCase
Tests run: 13, Failures: 0, Errors: 0, Skipped: 0, Time elapsed: 0.712 sec
Running org.syncope.core.rest.ConnInstanceTestITCase
Tests run: 10, Failures: 0, Errors: 2, Skipped: 0, Time elapsed: 0.548 sec <<< FAILURE!
Running org.syncope.core.rest.VirtualSchemaTestITCase
Tests run: 4, Failures: 0, Errors: 0, Skipped: 0, Time elapsed: 0.196 sec

Results :

Tests in error:
  check(org.syncope.core.rest.ConnInstanceTestITCase): {[NotFound [Resource 'ws-target-resource-1']], }
  getSchemaNames(org.syncope.core.rest.ConnInstanceTestITCase): {[NotFound [Resource 'ws-target-resource-1']], }

Tests run: 97, Failures: 0, Errors: 2, Skipped: 0

[JENKINS] Recording test results
[INFO]
[INFO] --- cargo-maven2-plugin:1.1.2:stop (stop-container) @ syncope-core ---
[INFO]
[INFO] --- maven-failsafe-plugin:2.9:verify (default) @ syncope-core ---
[INFO] Failsafe report directory: <http://jenkins.syncope-idm.org/job/Syncope%20trunk%20(GNU%20Linux)/org.syncope$syncope-core/ws/target/failsafe-reports>
[JENKINS] Archiving <http://jenkins.syncope-idm.org/job/Syncope%20trunk%20(GNU%20Linux)/org.syncope$syncope-core/ws/pom.xml> to /var/lib/jenkins/jobs/Syncope trunk (GNU Linux)/modules/org.syncope$syncope-core/builds/2011-09-23_17-35-12/archive/org.syncope/syncope-core/0.7-SNAPSHOT/syncope-core-0.7-SNAPSHOT.pom
[JENKINS] Archiving <http://jenkins.syncope-idm.org/job/Syncope%20trunk%20(GNU%20Linux)/org.syncope$syncope-core/ws/target/syncope.war> to /var/lib/jenkins/jobs/Syncope trunk (GNU Linux)/modules/org.syncope$syncope-core/builds/2011-09-23_17-35-12/archive/org.syncope/syncope-core/0.7-SNAPSHOT/syncope-core-0.7-SNAPSHOT.war
[JENKINS] Archiving <http://jenkins.syncope-idm.org/job/Syncope%20trunk%20(GNU%20Linux)/org.syncope$syncope-core/ws/target/syncope-classes.jar> to /var/lib/jenkins/jobs/Syncope trunk (GNU Linux)/modules/org.syncope$syncope-core/builds/2011-09-23_17-35-12/archive/org.syncope/syncope-core/0.7-SNAPSHOT/syncope-core-0.7-SNAPSHOT-classes.jar

Reply | Threaded
Open this post in threaded view
|

[syncope-dev] Build failed in Jenkins: Syncope trunk (GNU Linux) » Syncope core #42

jenkins
See <http://jenkins.syncope-idm.org/job/Syncope%20trunk%20(GNU%20Linux)/org.syncope$syncope-core/42/>

------------------------------------------
[INFO]                                                                        
[INFO] ------------------------------------------------------------------------
[INFO] Building Syncope core 0.7-SNAPSHOT
[INFO] ------------------------------------------------------------------------
[INFO]
[INFO] --- maven-clean-plugin:2.4.1:clean (default-clean) @ syncope-core ---
[INFO]
[INFO] --- maven-enforcer-plugin:1.0:enforce (enforce-maven) @ syncope-core ---
[INFO]
[INFO] --- syncope-build-tools:0.7-SNAPSHOT:set-dynamic-properties (set-dynamic-properties) @ syncope-core ---
[INFO]
[INFO] --- maven-resources-plugin:2.5:resources (default-resources) @ syncope-core ---
[debug] execute contextualize
[INFO] Using 'UTF-8' encoding to copy filtered resources.
[INFO] Copying 27 resources
[INFO]
[INFO] --- maven-compiler-plugin:2.3.2:compile (default-compile) @ syncope-core ---
[INFO] Compiling 205 source files to <http://jenkins.syncope-idm.org/job/Syncope%20trunk%20(GNU%20Linux)/org.syncope$syncope-core/ws/target/classes>
[INFO] [debug] execute contextualize

[INFO] Using 'UTF-8' encoding to copy filtered resources.
[INFO] --- maven-resources-plugin:2.5:testResources (default-testResources) @ syncope-core ---
[INFO] Copying 11 resources
[INFO]
[INFO] --- maven-compiler-plugin:2.3.2:testCompile (default-testCompile) @ syncope-core ---
[INFO] Compiling 42 source files to <http://jenkins.syncope-idm.org/job/Syncope%20trunk%20(GNU%20Linux)/org.syncope$syncope-core/ws/target/test-classes>
[INFO]
[INFO] --- maven-surefire-plugin:2.9:test (default-test) @ syncope-core ---
[INFO] Tests are skipped.
[INFO]
[INFO] --- maven-surefire-plugin:2.9:test (test-phase-execution) @ syncope-core ---
[INFO] Surefire report directory: <http://jenkins.syncope-idm.org/job/Syncope%20trunk%20(GNU%20Linux)/org.syncope$syncope-core/ws/target/surefire-reports>

-------------------------------------------------------
 T E S T S
-------------------------------------------------------
Running jpasymphony.dao.JPAWorkflowEntryTest
Tests run: 1, Failures: 0, Errors: 0, Skipped: 0, Time elapsed: 7.664 sec
Running org.syncope.core.persistence.dao.SchemaTest
Tests run: 7, Failures: 0, Errors: 0, Skipped: 0, Time elapsed: 0.284 sec
Running org.syncope.core.persistence.dao.ConnInstanceTest
Tests run: 4, Failures: 0, Errors: 0, Skipped: 0, Time elapsed: 0.05 sec
Running org.syncope.core.persistence.dao.PolicyTest
Tests run: 9, Failures: 0, Errors: 0, Skipped: 0, Time elapsed: 0.102 sec
Running org.syncope.core.persistence.dao.TaskTest
Tests run: 4, Failures: 0, Errors: 0, Skipped: 0, Time elapsed: 0.504 sec
Running org.syncope.core.persistence.dao.TaskExecTest
Tests run: 2, Failures: 0, Errors: 0, Skipped: 0, Time elapsed: 0.059 sec
Running org.syncope.core.persistence.dao.DerAttrTest
Tests run: 6, Failures: 0, Errors: 0, Skipped: 0, Time elapsed: 0.145 sec
Running org.syncope.core.persistence.dao.VirSchemaTest
Tests run: 4, Failures: 0, Errors: 0, Skipped: 0, Time elapsed: 0.05 sec
Running org.syncope.core.persistence.dao.RoleTest
Tests run: 8, Failures: 0, Errors: 0, Skipped: 0, Time elapsed: 0.213 sec
Running org.syncope.core.persistence.dao.VirAttrTest
Tests run: 6, Failures: 0, Errors: 0, Skipped: 0, Time elapsed: 0.099 sec
Running org.syncope.core.persistence.dao.EntitlementTest
Tests run: 4, Failures: 0, Errors: 0, Skipped: 0, Time elapsed: 0.106 sec
Running org.syncope.core.persistence.dao.DerSchemaTest
Tests run: 4, Failures: 0, Errors: 0, Skipped: 0, Time elapsed: 0.055 sec
Running org.syncope.core.persistence.dao.MembershipTest
Tests run: 4, Failures: 0, Errors: 0, Skipped: 0, Time elapsed: 0.123 sec
Running org.syncope.core.persistence.dao.ResourceTest
Tests run: 6, Failures: 0, Errors: 0, Skipped: 0, Time elapsed: 0.138 sec
Running org.syncope.core.persistence.dao.UserSearchTest
Tests run: 7, Failures: 0, Errors: 0, Skipped: 0, Time elapsed: 0.541 sec
Running org.syncope.core.persistence.dao.UserTest
Tests run: 11, Failures: 0, Errors: 0, Skipped: 0, Time elapsed: 0.312 sec
Running org.syncope.core.persistence.dao.AttrTest
Tests run: 7, Failures: 0, Errors: 0, Skipped: 0, Time elapsed: 0.108 sec

Results :

Tests run: 94, Failures: 0, Errors: 0, Skipped: 0

[JENKINS] Recording test results
[INFO]
[INFO] --- maven-surefire-plugin:2.9:test (relationship-test-execution) @ syncope-core ---
[INFO] Surefire report directory: <http://jenkins.syncope-idm.org/job/Syncope%20trunk%20(GNU%20Linux)/org.syncope$syncope-core/ws/target/surefire-reports>

-------------------------------------------------------
 T E S T S
-------------------------------------------------------
Running jpasymphony.relationships.JPAWorkflowEntryTest
Tests run: 1, Failures: 0, Errors: 0, Skipped: 0, Time elapsed: 6.479 sec
Running org.syncope.core.persistence.relationships.SchemaTest
Tests run: 2, Failures: 0, Errors: 0, Skipped: 0, Time elapsed: 0.207 sec
Running org.syncope.core.persistence.relationships.TaskTest
Tests run: 6, Failures: 0, Errors: 0, Skipped: 0, Time elapsed: 0.478 sec
Running org.syncope.core.persistence.relationships.RoleTest
Tests run: 1, Failures: 0, Errors: 0, Skipped: 0, Time elapsed: 0.084 sec
Running org.syncope.core.persistence.relationships.DerSchemaTest
Tests run: 1, Failures: 0, Errors: 0, Skipped: 0, Time elapsed: 0.041 sec
Running org.syncope.core.persistence.relationships.MembershipTest
Tests run: 2, Failures: 0, Errors: 0, Skipped: 0, Time elapsed: 0.115 sec
Running org.syncope.core.persistence.relationships.ResourceTest
Tests run: 3, Failures: 0, Errors: 0, Skipped: 0, Time elapsed: 0.191 sec
Running org.syncope.core.persistence.relationships.UserTest
Tests run: 1, Failures: 0, Errors: 0, Skipped: 0, Time elapsed: 0.115 sec
Running org.syncope.core.persistence.relationships.AttrTest
Tests run: 3, Failures: 0, Errors: 0, Skipped: 0, Time elapsed: 0.089 sec

Results :

Tests run: 20, Failures: 0, Errors: 0, Skipped: 0

[JENKINS] Recording test results
[INFO]
[INFO] --- maven-war-plugin:2.1.1:war (default-war) @ syncope-core ---
[INFO] Packaging webapp
[INFO] Assembling webapp [syncope-core] in [<http://jenkins.syncope-idm.org/job/Syncope%20trunk%20(GNU%20Linux)/org.syncope$syncope-core/ws/target/syncope]>
[INFO] Processing war project
[INFO] Copying webapp webResources [<http://jenkins.syncope-idm.org/job/Syncope%20trunk%20(GNU%20Linux)/org.syncope$syncope-core/ws/src/main/webapp]> to [<http://jenkins.syncope-idm.org/job/Syncope%20trunk%20(GNU%20Linux)/org.syncope$syncope-core/ws/target/syncope]>
[INFO] Copying webapp resources [<http://jenkins.syncope-idm.org/job/Syncope%20trunk%20(GNU%20Linux)/org.syncope$syncope-core/ws/src/main/webapp]>
[INFO] Webapp assembled in [271 msecs]
[INFO] Building war: <http://jenkins.syncope-idm.org/job/Syncope%20trunk%20(GNU%20Linux)/org.syncope$syncope-core/ws/target/syncope.war>
[INFO] WEB-INF/web.xml already added, skipping
[INFO] Packaging classes
[INFO] Building jar: <http://jenkins.syncope-idm.org/job/Syncope%20trunk%20(GNU%20Linux)/org.syncope$syncope-core/ws/target/syncope-classes.jar>
[INFO]
[INFO] --- maven-antrun-plugin:1.6:run (explodeSyncopeWAR) @ syncope-core ---
[INFO] Executing tasks

main:
    [unzip] Expanding: <http://jenkins.syncope-idm.org/job/Syncope%20trunk%20(GNU%20Linux)/org.syncope$syncope-core/ws/target/syncope.war> into <http://jenkins.syncope-idm.org/job/Syncope%20trunk%20(GNU%20Linux)/org.syncope$syncope-core/ws/target/syncope-core-test>
[INFO] Executed tasks
[INFO]
[INFO] --- maven-antrun-plugin:1.6:run (setupTomcat) @ syncope-core ---
[INFO] Executing tasks

main:
      [get] Destination already exists (skipping): /tmp/apache-tomcat-7.0.21.zip
    [unzip] Expanding: /tmp/apache-tomcat-7.0.21.zip into /tmp
[INFO] Executed tasks
[INFO]
[INFO] --- maven-antrun-plugin:1.6:run (setupCSV) @ syncope-core ---
[INFO] Executing tasks

main:
     [copy] Copying 1 file to /tmp
[INFO] Executed tasks
[INFO]
[INFO] --- maven-dependency-plugin:2.3:copy (set-bundles) @ syncope-core ---
[INFO] Configured Artifact: org.connid.bundles.soap:org.connid.bundles.soap:1.1:jar
[INFO] Configured Artifact: org.connid.bundles.db:org.connid.bundles.db.table:1.2.1:jar
[INFO] Configured Artifact: org.connid.bundles:org.connid.bundles.csvdir:0.1:jar
[INFO] Copying org.connid.bundles.soap-1.1.jar to <http://jenkins.syncope-idm.org/job/Syncope%20trunk%20(GNU%20Linux)/org.syncope$syncope-core/ws/target/bundles/org.connid.bundles.soap-1.1.jar>
[INFO] Copying org.connid.bundles.db.table-1.2.1.jar to <http://jenkins.syncope-idm.org/job/Syncope%20trunk%20(GNU%20Linux)/org.syncope$syncope-core/ws/target/bundles/org.connid.bundles.db.table-1.2.1.jar>
[INFO] Copying org.connid.bundles.csvdir-0.1.jar to <http://jenkins.syncope-idm.org/job/Syncope%20trunk%20(GNU%20Linux)/org.syncope$syncope-core/ws/target/bundles/org.connid.bundles.csvdir-0.1.jar>
[INFO]
[INFO] --- maven-hsqldb-plugin:1.0:run (startTestDb) @ syncope-core ---
[Server@a37aa32]: [Thread[pool-1-thread-1,5,main]]: setSilent(true)
[Server@a37aa32]: Initiating startup sequence...
[Server@a37aa32]: Server socket opened successfully in 2 ms.
[Server@a37aa32]: Database [index=0, id=0, db=mem:testdb, alias=testdb] opened sucessfully in 252 ms.
[Server@a37aa32]: Startup sequence completed in 256 ms.
[Server@a37aa32]: 2011-09-23 17:53:05.097 HSQLDB server 2.2.4 is online on port 9001
[Server@a37aa32]: To close normally, connect and execute SHUTDOWN SQL
[Server@a37aa32]: From command line, use [Ctrl]+[C] to abort abruptly
[INFO] HSQL Launched
[INFO] ONLINE
[INFO] Live name: testdb
[INFO]
[INFO] --- sql-maven-plugin:1.4:execute (loadTestDb) @ syncope-core ---
[INFO] Executing file: /tmp/testdb.971447486sql
[INFO] 4 of 4 SQL statements executed successfully
[INFO]
[INFO] --- cargo-maven2-plugin:1.1.2:start (start-container) @ syncope-core ---
[INFO]
[INFO] --- maven-failsafe-plugin:2.9:integration-test (default) @ syncope-core ---
[INFO] Failsafe report directory: <http://jenkins.syncope-idm.org/job/Syncope%20trunk%20(GNU%20Linux)/org.syncope$syncope-core/ws/target/failsafe-reports>

-------------------------------------------------------
 T E S T S
-------------------------------------------------------
Running org.syncope.core.rest.TaskTestITCase
Tests run: 10, Failures: 0, Errors: 0, Skipped: 0, Time elapsed: 19.548 sec
Running org.syncope.core.rest.AuthenticationTestITCase
Tests run: 4, Failures: 0, Errors: 0, Skipped: 0, Time elapsed: 1.249 sec
Running org.syncope.core.rest.UserTestITCase
Tests run: 22, Failures: 0, Errors: 0, Skipped: 0, Time elapsed: 5.351 sec
Running org.syncope.core.rest.PolicyTestITCase
Tests run: 9, Failures: 0, Errors: 0, Skipped: 0, Time elapsed: 0.583 sec
Running org.syncope.core.rest.SchemaTestITCase
Tests run: 4, Failures: 0, Errors: 0, Skipped: 0, Time elapsed: 0.402 sec
Running org.syncope.core.rest.LogTestITCase
Tests run: 1, Failures: 0, Errors: 0, Skipped: 0, Time elapsed: 0.048 sec
Running org.syncope.core.rest.ConfigurationTestITCase
Tests run: 5, Failures: 0, Errors: 0, Skipped: 0, Time elapsed: 0.286 sec
Running org.syncope.core.rest.DerivedSchemaTestITCase
Tests run: 5, Failures: 0, Errors: 0, Skipped: 0, Time elapsed: 0.259 sec
Running org.syncope.core.rest.RoleTestITCase
Tests run: 10, Failures: 0, Errors: 0, Skipped: 0, Time elapsed: 0.542 sec
Running org.syncope.core.rest.ResourceTestITCase
Tests run: 13, Failures: 0, Errors: 0, Skipped: 0, Time elapsed: 0.676 sec
Running org.syncope.core.rest.ConnInstanceTestITCase
Tests run: 10, Failures: 0, Errors: 2, Skipped: 0, Time elapsed: 0.527 sec <<< FAILURE!
Running org.syncope.core.rest.VirtualSchemaTestITCase
Tests run: 4, Failures: 0, Errors: 0, Skipped: 0, Time elapsed: 0.199 sec

Results :

Tests in error:
  check(org.syncope.core.rest.ConnInstanceTestITCase): {[NotFound [Resource 'ws-target-resource-1']], }
  getSchemaNames(org.syncope.core.rest.ConnInstanceTestITCase): {[NotFound [Resource 'ws-target-resource-1']], }

Tests run: 97, Failures: 0, Errors: 2, Skipped: 0

[JENKINS] Recording test results
[INFO]
[INFO] --- cargo-maven2-plugin:1.1.2:stop (stop-container) @ syncope-core ---
[INFO]
[INFO] --- maven-failsafe-plugin:2.9:verify (default) @ syncope-core ---
[INFO] Failsafe report directory: <http://jenkins.syncope-idm.org/job/Syncope%20trunk%20(GNU%20Linux)/org.syncope$syncope-core/ws/target/failsafe-reports>
[JENKINS] Archiving <http://jenkins.syncope-idm.org/job/Syncope%20trunk%20(GNU%20Linux)/org.syncope$syncope-core/ws/pom.xml> to /var/lib/jenkins/jobs/Syncope trunk (GNU Linux)/modules/org.syncope$syncope-core/builds/2011-09-23_17-51-25/archive/org.syncope/syncope-core/0.7-SNAPSHOT/syncope-core-0.7-SNAPSHOT.pom
[JENKINS] Archiving <http://jenkins.syncope-idm.org/job/Syncope%20trunk%20(GNU%20Linux)/org.syncope$syncope-core/ws/target/syncope.war> to /var/lib/jenkins/jobs/Syncope trunk (GNU Linux)/modules/org.syncope$syncope-core/builds/2011-09-23_17-51-25/archive/org.syncope/syncope-core/0.7-SNAPSHOT/syncope-core-0.7-SNAPSHOT.war
[JENKINS] Archiving <http://jenkins.syncope-idm.org/job/Syncope%20trunk%20(GNU%20Linux)/org.syncope$syncope-core/ws/target/syncope-classes.jar> to /var/lib/jenkins/jobs/Syncope trunk (GNU Linux)/modules/org.syncope$syncope-core/builds/2011-09-23_17-51-25/archive/org.syncope/syncope-core/0.7-SNAPSHOT/syncope-core-0.7-SNAPSHOT-classes.jar

Reply | Threaded
Open this post in threaded view
|

[syncope-dev] Jenkins build is back to normal : Syncope trunk (GNU Linux) » Syncope core #43

jenkins