[syncope-dev] Build failed in Jenkins: Syncope trunk (GNU Linux) #57

classic Classic list List threaded Threaded
7 messages Options
Reply | Threaded
Open this post in threaded view
|

[syncope-dev] Build failed in Jenkins: Syncope trunk (GNU Linux) #57

jenkins
See <http://jenkins.syncope-idm.org/job/Syncope%20trunk%20(GNU%20Linux)/57/>

------------------------------------------
[...truncated 1001 lines...]
[INFO] Using 'UTF-8' encoding to copy filtered resources.
[INFO] Copying 27 resources
[INFO]
[INFO] --- maven-compiler-plugin:2.3.2:compile (default-compile) @ syncope-core ---
[INFO] Compiling 188 source files to <http://jenkins.syncope-idm.org/job/Syncope%20trunk%20(GNU%20Linux)/ws/core/target/classes>
[INFO]
[debug] execute contextualize
[INFO] --- maven-resources-plugin:2.5:testResources (default-testResources) @ syncope-core ---
[INFO] Using 'UTF-8' encoding to copy filtered resources.
[INFO] Copying 12 resources
[INFO]
[INFO] --- maven-dependency-plugin:2.3:copy (set-bundles) @ syncope-core ---
[INFO] Configured Artifact: org.connid.bundles.soap:org.connid.bundles.soap:1.1:jar
[INFO] Configured Artifact: org.connid.bundles.db:org.connid.bundles.db.table:1.2.1:jar
[INFO] Configured Artifact: org.connid.bundles:org.connid.bundles.csvdir:0.1:jar
[INFO] Copying org.connid.bundles.soap-1.1.jar to <http://jenkins.syncope-idm.org/job/Syncope%20trunk%20(GNU%20Linux)/ws/core/target/bundles/org.connid.bundles.soap-1.1.jar>
[INFO] Copying org.connid.bundles.db.table-1.2.1.jar to <http://jenkins.syncope-idm.org/job/Syncope%20trunk%20(GNU%20Linux)/ws/core/target/bundles/org.connid.bundles.db.table-1.2.1.jar>
[INFO] Copying org.connid.bundles.csvdir-0.1.jar to <http://jenkins.syncope-idm.org/job/Syncope%20trunk%20(GNU%20Linux)/ws/core/target/bundles/org.connid.bundles.csvdir-0.1.jar>
[INFO]
[INFO] --- maven-compiler-plugin:2.3.2:testCompile (default-testCompile) @ syncope-core ---
[INFO] Compiling 40 source files to <http://jenkins.syncope-idm.org/job/Syncope%20trunk%20(GNU%20Linux)/ws/core/target/test-classes>
[INFO]
[INFO] --- maven-surefire-plugin:2.9:test (default-test) @ syncope-core ---
[INFO] Tests are skipped.
[INFO]
[INFO] --- maven-surefire-plugin:2.9:test (test-phase-execution) @ syncope-core ---
[INFO] Surefire report directory: <http://jenkins.syncope-idm.org/job/Syncope%20trunk%20(GNU%20Linux)/ws/core/target/surefire-reports>

-------------------------------------------------------
 T E S T S
-------------------------------------------------------
Running org.syncope.core.persistence.dao.SchemaTest
Tests run: 7, Failures: 0, Errors: 0, Skipped: 0, Time elapsed: 61.095 sec
Running org.syncope.core.persistence.dao.ConnInstanceTest
Tests run: 4, Failures: 0, Errors: 0, Skipped: 0, Time elapsed: 0.041 sec
Running org.syncope.core.persistence.dao.PolicyTest
Tests run: 9, Failures: 0, Errors: 0, Skipped: 0, Time elapsed: 1.301 sec
Running org.syncope.core.persistence.dao.TaskTest
Tests run: 4, Failures: 0, Errors: 0, Skipped: 0, Time elapsed: 2.118 sec
Running org.syncope.core.persistence.dao.TaskExecTest
Tests run: 2, Failures: 0, Errors: 0, Skipped: 0, Time elapsed: 0.488 sec
Running org.syncope.core.persistence.dao.DerAttrTest
Tests run: 6, Failures: 0, Errors: 0, Skipped: 0, Time elapsed: 0 sec
Running org.syncope.core.persistence.dao.VirSchemaTest
Tests run: 4, Failures: 0, Errors: 0, Skipped: 0, Time elapsed: 0.152 sec
Running org.syncope.core.persistence.dao.RoleTest
Tests run: 8, Failures: 0, Errors: 0, Skipped: 0, Time elapsed: 0.231 sec
Running org.syncope.core.persistence.dao.VirAttrTest
Tests run: 6, Failures: 0, Errors: 0, Skipped: 0, Time elapsed: 6.335 sec
Running org.syncope.core.persistence.dao.EntitlementTest
Tests run: 4, Failures: 0, Errors: 0, Skipped: 0, Time elapsed: 1.833 sec
Running org.syncope.core.persistence.dao.DerSchemaTest
Tests run: 4, Failures: 0, Errors: 0, Skipped: 0, Time elapsed: 3.805 sec
Running org.syncope.core.persistence.dao.MembershipTest
Tests run: 4, Failures: 0, Errors: 0, Skipped: 0, Time elapsed: 0.921 sec
Running org.syncope.core.persistence.dao.ResourceTest
Tests run: 6, Failures: 0, Errors: 0, Skipped: 0, Time elapsed: 6.036 sec
Running org.syncope.core.persistence.dao.UserSearchTest
Tests run: 7, Failures: 0, Errors: 0, Skipped: 0, Time elapsed: 17.295 sec
Running org.syncope.core.persistence.dao.UserTest
Tests run: 11, Failures: 0, Errors: 0, Skipped: 0, Time elapsed: 1.827 sec
Running org.syncope.core.persistence.dao.AttrTest
Tests run: 7, Failures: 0, Errors: 0, Skipped: 0, Time elapsed: 7.545 sec
Running org.syncope.core.rest.data.ResourceDataBinderTest
Tests run: 2, Failures: 0, Errors: 0, Skipped: 0, Time elapsed: 0.347 sec
Running org.syncope.core.init.ConnInstanceLoaderTest
Tests run: 2, Failures: 0, Errors: 0, Skipped: 0, Time elapsed: 1.39 sec

Results :

Tests run: 97, Failures: 0, Errors: 0, Skipped: 0

[JENKINS] Recording test results
[INFO]
[INFO] --- maven-surefire-plugin:2.9:test (relationship-test-execution) @ syncope-core ---
[INFO] Surefire report directory: <http://jenkins.syncope-idm.org/job/Syncope%20trunk%20(GNU%20Linux)/ws/core/target/surefire-reports>

-------------------------------------------------------
 T E S T S
-------------------------------------------------------
Running org.syncope.core.persistence.relationships.SchemaTest
Tests run: 2, Failures: 0, Errors: 0, Skipped: 0, Time elapsed: 27.852 sec
Running org.syncope.core.persistence.relationships.TaskTest
Tests run: 6, Failures: 0, Errors: 0, Skipped: 0, Time elapsed: 0.345 sec
Running org.syncope.core.persistence.relationships.RoleTest
Tests run: 1, Failures: 0, Errors: 0, Skipped: 0, Time elapsed: 0.086 sec
Running org.syncope.core.persistence.relationships.DerSchemaTest
Tests run: 1, Failures: 0, Errors: 0, Skipped: 0, Time elapsed: 0.051 sec
Running org.syncope.core.persistence.relationships.MembershipTest
Tests run: 2, Failures: 0, Errors: 0, Skipped: 0, Time elapsed: 0.142 sec
Running org.syncope.core.persistence.relationships.ResourceTest
Tests run: 3, Failures: 0, Errors: 0, Skipped: 0, Time elapsed: 0.26 sec
Running org.syncope.core.persistence.relationships.UserTest
Tests run: 1, Failures: 0, Errors: 0, Skipped: 0, Time elapsed: 0.06 sec
Running org.syncope.core.persistence.relationships.AttrTest
Tests run: 3, Failures: 0, Errors: 0, Skipped: 0, Time elapsed: 0.095 sec

Results :

Tests run: 19, Failures: 0, Errors: 0, Skipped: 0

[JENKINS] Recording test results
[INFO]
[INFO] --- maven-war-plugin:2.1.1:war (default-war) @ syncope-core ---
[INFO] Packaging webapp
[INFO] Assembling webapp [syncope-core] in [<http://jenkins.syncope-idm.org/job/Syncope%20trunk%20(GNU%20Linux)/ws/core/target/syncope]>
[INFO] Processing war project
[INFO] Copying webapp webResources [<http://jenkins.syncope-idm.org/job/Syncope%20trunk%20(GNU%20Linux)/ws/core/src/main/webapp]> to [<http://jenkins.syncope-idm.org/job/Syncope%20trunk%20(GNU%20Linux)/ws/core/target/syncope]>
[INFO] Copying webapp resources [<http://jenkins.syncope-idm.org/job/Syncope%20trunk%20(GNU%20Linux)/ws/core/src/main/webapp]>
[INFO] Webapp assembled in [2343 msecs]
[INFO] Building war: <http://jenkins.syncope-idm.org/job/Syncope%20trunk%20(GNU%20Linux)/ws/core/target/syncope.war>
[INFO] WEB-INF/web.xml already added, skipping
[INFO] Packaging classes
[INFO] Building jar: <http://jenkins.syncope-idm.org/job/Syncope%20trunk%20(GNU%20Linux)/ws/core/target/syncope-classes.jar>
[INFO]
[INFO] --- maven-antrun-plugin:1.6:run (explodeSyncopeWAR) @ syncope-core ---
[INFO] Executing tasks

main:
    [unzip] Expanding: <http://jenkins.syncope-idm.org/job/Syncope%20trunk%20(GNU%20Linux)/ws/core/target/syncope.war> into <http://jenkins.syncope-idm.org/job/Syncope%20trunk%20(GNU%20Linux)/ws/core/target/syncope-core-test>
[INFO] Executed tasks
[INFO]
[INFO] --- maven-antrun-plugin:1.6:run (setupTomcat) @ syncope-core ---
[INFO] Executing tasks

main:
      [get] Destination already exists (skipping): /tmp/apache-tomcat-7.0.22.zip
    [unzip] Expanding: /tmp/apache-tomcat-7.0.22.zip into /tmp
[INFO] Executed tasks
[INFO]
[INFO] --- maven-antrun-plugin:1.6:run (setupCSV) @ syncope-core ---
[INFO] Executing tasks

main:
     [copy] Copying 1 file to /tmp
[INFO] Executed tasks
[INFO]
[INFO] --- maven-enforcer-plugin:1.0:enforce (enforce-maven) @ syncope-core ---
[INFO]
[INFO] --- syncope-build-tools:0.7-SNAPSHOT:set-dynamic-properties (set-dynamic-properties) @ syncope-core ---
[JENKINS] Archiving <http://jenkins.syncope-idm.org/job/Syncope%20trunk%20(GNU%20Linux)/ws/core/pom.xml> to /var/lib/jenkins/jobs/Syncope trunk (GNU Linux)/modules/org.syncope$syncope-core/builds/2011-10-13_11-41-56/archive/org.syncope/syncope-core/0.7-SNAPSHOT/syncope-core-0.7-SNAPSHOT.pom
[JENKINS] Archiving <http://jenkins.syncope-idm.org/job/Syncope%20trunk%20(GNU%20Linux)/ws/core/target/syncope.war> to /var/lib/jenkins/jobs/Syncope trunk (GNU Linux)/modules/org.syncope$syncope-core/builds/2011-10-13_11-41-56/archive/org.syncope/syncope-core/0.7-SNAPSHOT/syncope-core-0.7-SNAPSHOT.war
[JENKINS] Archiving <http://jenkins.syncope-idm.org/job/Syncope%20trunk%20(GNU%20Linux)/ws/core/target/syncope-classes.jar> to /var/lib/jenkins/jobs/Syncope trunk (GNU Linux)/modules/org.syncope$syncope-core/builds/2011-10-13_11-41-56/archive/org.syncope/syncope-core/0.7-SNAPSHOT/syncope-core-0.7-SNAPSHOT-classes.jar
ignoring exception during new ExecutedMojo null
[INFO]
[INFO] --- exec-maven-plugin:1.2.1:java (startTestDb) @ syncope-core ---
Web Console server running at http://192.168.0.1:8082 (only local connections)
TCP server running at tcp://192.168.0.1:9092 (only local connections)
[INFO]
[INFO] --- sql-maven-plugin:1.4:execute (loadTestDb) @ syncope-core ---
[INFO] Executing file: /tmp/testdb.2080131097sql
[INFO] 4 of 4 SQL statements executed successfully
[INFO]
[INFO] --- cargo-maven2-plugin:1.1.2:start (start-container) @ syncope-core ---
[INFO] ------------------------------------------------------------------------
[INFO] Reactor Summary:
[INFO]
[INFO] Syncope ........................................... SUCCESS [15.827s]
[INFO] Syncope build tools ............................... SUCCESS [21.795s]
[INFO] Syncope client .................................... SUCCESS [1:29.661s]
[INFO] Syncope core ...................................... FAILURE [6:35.764s]
[INFO] Syncope console ................................... SKIPPED
[INFO] Syncope archetype ................................. SKIPPED
[INFO] ------------------------------------------------------------------------
[INFO] BUILD FAILURE
[INFO] ------------------------------------------------------------------------
[INFO] Total time: 9:15.469s
[INFO] Finished at: Thu Oct 13 11:51:19 CEST 2011
[INFO] Final Memory: 61M/480M
[INFO] ------------------------------------------------------------------------
mavenExecutionResult exceptions not empty
message : Failed to execute goal org.codehaus.cargo:cargo-maven2-plugin:1.1.2:start (start-container) on project syncope-core: Execution start-container of goal org.codehaus.cargo:cargo-maven2-plugin:1.1.2:start failed: Failed to start the Tomcat 7.x container. Check the [<http://jenkins.syncope-idm.org/job/Syncope%20trunk%20(GNU%20Linux)/ws/core/target/log/core-cargo-output.log]> file containing the container logs for more details.
cause : Execution start-container of goal org.codehaus.cargo:cargo-maven2-plugin:1.1.2:start failed: Failed to start the Tomcat 7.x container. Check the [<http://jenkins.syncope-idm.org/job/Syncope%20trunk%20(GNU%20Linux)/ws/core/target/log/core-cargo-output.log]> file containing the container logs for more details.
Stack trace :
org.apache.maven.lifecycle.LifecycleExecutionException: Failed to execute goal org.codehaus.cargo:cargo-maven2-plugin:1.1.2:start (start-container) on project syncope-core: Execution start-container of goal org.codehaus.cargo:cargo-maven2-plugin:1.1.2:start failed: Failed to start the Tomcat 7.x container. Check the [<http://jenkins.syncope-idm.org/job/Syncope%20trunk%20(GNU%20Linux)/ws/core/target/log/core-cargo-output.log]> file containing the container logs for more details.
        at org.apache.maven.lifecycle.internal.MojoExecutor.execute(MojoExecutor.java:225)
        at org.apache.maven.lifecycle.internal.MojoExecutor.execute(MojoExecutor.java:153)
        at org.apache.maven.lifecycle.internal.MojoExecutor.execute(MojoExecutor.java:145)
        at org.apache.maven.lifecycle.internal.LifecycleModuleBuilder.buildProject(LifecycleModuleBuilder.java:84)
        at org.apache.maven.lifecycle.internal.LifecycleModuleBuilder.buildProject(LifecycleModuleBuilder.java:59)
        at org.apache.maven.lifecycle.internal.LifecycleStarter.singleThreadedBuild(LifecycleStarter.java:183)
        at org.apache.maven.lifecycle.internal.LifecycleStarter.execute(LifecycleStarter.java:161)
        at org.apache.maven.DefaultMaven.doExecute(DefaultMaven.java:319)
        at org.apache.maven.DefaultMaven.execute(DefaultMaven.java:156)
        at org.jvnet.hudson.maven3.launcher.Maven3Launcher.main(Maven3Launcher.java:79)
        at sun.reflect.NativeMethodAccessorImpl.invoke0(Native Method)
        at sun.reflect.NativeMethodAccessorImpl.invoke(NativeMethodAccessorImpl.java:39)
        at sun.reflect.DelegatingMethodAccessorImpl.invoke(DelegatingMethodAccessorImpl.java:25)
        at java.lang.reflect.Method.invoke(Method.java:597)
        at org.codehaus.plexus.classworlds.launcher.Launcher.launchStandard(Launcher.java:329)
        at org.codehaus.plexus.classworlds.launcher.Launcher.launch(Launcher.java:239)
        at org.jvnet.hudson.maven3.agent.Maven3Main.launch(Maven3Main.java:158)
        at hudson.maven.Maven3Builder.call(Maven3Builder.java:122)
        at hudson.maven.Maven3Builder.call(Maven3Builder.java:74)
        at hudson.remoting.UserRequest.perform(UserRequest.java:118)
        at hudson.remoting.UserRequest.perform(UserRequest.java:48)
        at hudson.remoting.Request$2.run(Request.java:287)
        at java.util.concurrent.Executors$RunnableAdapter.call(Executors.java:441)
        at java.util.concurrent.FutureTask$Sync.innerRun(FutureTask.java:303)
        at java.util.concurrent.FutureTask.run(FutureTask.java:138)
        at java.util.concurrent.ThreadPoolExecutor$Worker.runTask(ThreadPoolExecutor.java:886)
        at java.util.concurrent.ThreadPoolExecutor$Worker.run(ThreadPoolExecutor.java:908)
        at java.lang.Thread.run(Thread.java:662)
Caused by: org.apache.maven.plugin.PluginExecutionException: Execution start-container of goal org.codehaus.cargo:cargo-maven2-plugin:1.1.2:start failed: Failed to start the Tomcat 7.x container. Check the [<http://jenkins.syncope-idm.org/job/Syncope%20trunk%20(GNU%20Linux)/ws/core/target/log/core-cargo-output.log]> file containing the container logs for more details.
        at org.apache.maven.plugin.DefaultBuildPluginManager.executeMojo(DefaultBuildPluginManager.java:110)
        at org.apache.maven.lifecycle.internal.MojoExecutor.execute(MojoExecutor.java:209)
        ... 27 more
Caused by: org.codehaus.cargo.container.ContainerException: Failed to start the Tomcat 7.x container. Check the [<http://jenkins.syncope-idm.org/job/Syncope%20trunk%20(GNU%20Linux)/ws/core/target/log/core-cargo-output.log]> file containing the container logs for more details.
        at org.codehaus.cargo.container.spi.AbstractLocalContainer.start(AbstractLocalContainer.java:179)
        at org.codehaus.cargo.maven2.AbstractContainerStartMojo.doExecute(AbstractContainerStartMojo.java:55)
        at org.codehaus.cargo.maven2.ContainerStartMojo.doExecute(ContainerStartMojo.java:52)
        at org.codehaus.cargo.maven2.AbstractCargoMojo.execute(AbstractCargoMojo.java:279)
        at org.apache.maven.plugin.DefaultBuildPluginManager.executeMojo(DefaultBuildPluginManager.java:101)
        ... 28 more
Caused by: org.codehaus.cargo.container.ContainerException: Deployable [http://localhost:9080/cargocpc/index.html] failed to finish deploying within the timeout period [120000]. The Deployable state is thus unknown.
        at org.codehaus.cargo.container.spi.deployer.DeployerWatchdog.watch(DeployerWatchdog.java:111)
        at org.codehaus.cargo.container.spi.AbstractLocalContainer.waitForCompletion(AbstractLocalContainer.java:254)
        at org.codehaus.cargo.container.tomcat.internal.AbstractCatalinaInstalledLocalContainer.waitForCompletion(AbstractCatalinaInstalledLocalContainer.java:196)
        at org.codehaus.cargo.container.spi.AbstractLocalContainer.start(AbstractLocalContainer.java:173)
        ... 32 more
[CHECKSTYLE] Aggregating results of Syncope
[CHECKSTYLE] Using set difference to compute new warnings
[CHECKSTYLE] Not changing build status, since no threshold has been exceeded
[CHECKSTYLE] Aggregating results of Syncope build tools
[CHECKSTYLE] Using set difference to compute new warnings
[CHECKSTYLE] Not changing build status, since no threshold has been exceeded
[CHECKSTYLE] Aggregating results of Syncope client
[CHECKSTYLE] Using set difference to compute new warnings
[CHECKSTYLE] Not changing build status, since no threshold has been exceeded
[FINDBUGS] Aggregating results of Syncope
[FINDBUGS] Using set difference to compute new warnings
[FINDBUGS] Not changing build status, since no threshold has been exceeded
[FINDBUGS] Aggregating results of Syncope build tools
[FINDBUGS] Using set difference to compute new warnings
[FINDBUGS] Not changing build status, since no threshold has been exceeded
[FINDBUGS] Aggregating results of Syncope client
[FINDBUGS] Using set difference to compute new warnings
[FINDBUGS] Not changing build status, since no threshold has been exceeded
[PMD] Aggregating results of Syncope
[PMD] Using set difference to compute new warnings
[PMD] Not changing build status, since no threshold has been exceeded
[PMD] Aggregating results of Syncope build tools
[PMD] Using set difference to compute new warnings
[PMD] Not changing build status, since no threshold has been exceeded
[PMD] Aggregating results of Syncope client
[PMD] Using set difference to compute new warnings
[PMD] Not changing build status, since no threshold has been exceeded
Sending e-mails to: [hidden email]
channel stopped

Reply | Threaded
Open this post in threaded view
|

[syncope-dev] Build failed in Jenkins: Syncope trunk (GNU Linux) #58

jenkins
See <http://jenkins.syncope-idm.org/job/Syncope%20trunk%20(GNU%20Linux)/58/changes>

Changes:

[[hidden email]] Creations of a new user without having a global password policy stored into the local repository used to fail with a null pointer exception. This bug has been fixed introducing a simple control.

Fixes issue 172

------------------------------------------
[...truncated 1001 lines...]
[INFO] Using 'UTF-8' encoding to copy filtered resources.
[INFO] Copying 27 resources
[INFO]
[INFO] --- maven-compiler-plugin:2.3.2:compile (default-compile) @ syncope-core ---
[INFO] Compiling 190 source files to <http://jenkins.syncope-idm.org/job/Syncope%20trunk%20(GNU%20Linux)/ws/core/target/classes>
[INFO]
[debug] execute contextualize
[INFO] --- maven-resources-plugin:2.5:testResources (default-testResources) @ syncope-core ---
[INFO] Using 'UTF-8' encoding to copy filtered resources.
[INFO] Copying 12 resources
[INFO]
[INFO] --- maven-dependency-plugin:2.3:copy (set-bundles) @ syncope-core ---
[INFO] Configured Artifact: org.connid.bundles.soap:org.connid.bundles.soap:1.1:jar
[INFO] Configured Artifact: org.connid.bundles.db:org.connid.bundles.db.table:1.2.1:jar
[INFO] Configured Artifact: org.connid.bundles:org.connid.bundles.csvdir:0.1:jar
[INFO] Copying org.connid.bundles.soap-1.1.jar to <http://jenkins.syncope-idm.org/job/Syncope%20trunk%20(GNU%20Linux)/ws/core/target/bundles/org.connid.bundles.soap-1.1.jar>
[INFO] Copying org.connid.bundles.db.table-1.2.1.jar to <http://jenkins.syncope-idm.org/job/Syncope%20trunk%20(GNU%20Linux)/ws/core/target/bundles/org.connid.bundles.db.table-1.2.1.jar>
[INFO] Copying org.connid.bundles.csvdir-0.1.jar to <http://jenkins.syncope-idm.org/job/Syncope%20trunk%20(GNU%20Linux)/ws/core/target/bundles/org.connid.bundles.csvdir-0.1.jar>
[INFO]
[INFO] --- maven-compiler-plugin:2.3.2:testCompile (default-testCompile) @ syncope-core ---
[INFO] Compiling 40 source files to <http://jenkins.syncope-idm.org/job/Syncope%20trunk%20(GNU%20Linux)/ws/core/target/test-classes>
[INFO]
[INFO] --- maven-surefire-plugin:2.9:test (default-test) @ syncope-core ---
[INFO] Tests are skipped.
[INFO]
[INFO] --- maven-surefire-plugin:2.9:test (test-phase-execution) @ syncope-core ---
[INFO] Surefire report directory: <http://jenkins.syncope-idm.org/job/Syncope%20trunk%20(GNU%20Linux)/ws/core/target/surefire-reports>

-------------------------------------------------------
 T E S T S
-------------------------------------------------------
Running org.syncope.core.persistence.dao.SchemaTest
Tests run: 7, Failures: 0, Errors: 0, Skipped: 0, Time elapsed: 14.72 sec
Running org.syncope.core.persistence.dao.ConnInstanceTest
Tests run: 4, Failures: 0, Errors: 0, Skipped: 0, Time elapsed: 0.069 sec
Running org.syncope.core.persistence.dao.PolicyTest
Tests run: 9, Failures: 0, Errors: 0, Skipped: 0, Time elapsed: 0.226 sec
Running org.syncope.core.persistence.dao.TaskTest
Tests run: 4, Failures: 0, Errors: 0, Skipped: 0, Time elapsed: 0.32 sec
Running org.syncope.core.persistence.dao.TaskExecTest
Tests run: 2, Failures: 0, Errors: 0, Skipped: 0, Time elapsed: 0.078 sec
Running org.syncope.core.persistence.dao.DerAttrTest
Tests run: 6, Failures: 0, Errors: 0, Skipped: 0, Time elapsed: 0.184 sec
Running org.syncope.core.persistence.dao.VirSchemaTest
Tests run: 4, Failures: 0, Errors: 0, Skipped: 0, Time elapsed: 0.067 sec
Running org.syncope.core.persistence.dao.RoleTest
Tests run: 8, Failures: 0, Errors: 0, Skipped: 0, Time elapsed: 0.243 sec
Running org.syncope.core.persistence.dao.VirAttrTest
Tests run: 6, Failures: 0, Errors: 0, Skipped: 0, Time elapsed: 0.114 sec
Running org.syncope.core.persistence.dao.EntitlementTest
Tests run: 4, Failures: 0, Errors: 0, Skipped: 0, Time elapsed: 0.139 sec
Running org.syncope.core.persistence.dao.DerSchemaTest
Tests run: 4, Failures: 0, Errors: 0, Skipped: 0, Time elapsed: 0.105 sec
Running org.syncope.core.persistence.dao.MembershipTest
Tests run: 4, Failures: 0, Errors: 0, Skipped: 0, Time elapsed: 0.11 sec
Running org.syncope.core.persistence.dao.ResourceTest
Tests run: 6, Failures: 0, Errors: 0, Skipped: 0, Time elapsed: 0.237 sec
Running org.syncope.core.persistence.dao.UserSearchTest
Tests run: 7, Failures: 0, Errors: 0, Skipped: 0, Time elapsed: 6.956 sec
Running org.syncope.core.persistence.dao.UserTest
Tests run: 11, Failures: 0, Errors: 0, Skipped: 0, Time elapsed: 0.491 sec
Running org.syncope.core.persistence.dao.AttrTest
Tests run: 7, Failures: 0, Errors: 0, Skipped: 0, Time elapsed: 0.111 sec
Running org.syncope.core.rest.data.ResourceDataBinderTest
Tests run: 2, Failures: 0, Errors: 0, Skipped: 0, Time elapsed: 0.005 sec
Running org.syncope.core.init.ConnInstanceLoaderTest
Tests run: 2, Failures: 0, Errors: 0, Skipped: 0, Time elapsed: 0.213 sec

Results :

Tests run: 97, Failures: 0, Errors: 0, Skipped: 0

[JENKINS] Recording test results
[INFO]
[INFO] --- maven-surefire-plugin:2.9:test (relationship-test-execution) @ syncope-core ---
[INFO] Surefire report directory: <http://jenkins.syncope-idm.org/job/Syncope%20trunk%20(GNU%20Linux)/ws/core/target/surefire-reports>

-------------------------------------------------------
 T E S T S
-------------------------------------------------------
Running org.syncope.core.persistence.relationships.SchemaTest
Tests run: 2, Failures: 0, Errors: 0, Skipped: 0, Time elapsed: 7.885 sec
Running org.syncope.core.persistence.relationships.TaskTest
Tests run: 6, Failures: 0, Errors: 0, Skipped: 0, Time elapsed: 0.302 sec
Running org.syncope.core.persistence.relationships.RoleTest
Tests run: 1, Failures: 0, Errors: 0, Skipped: 0, Time elapsed: 0.084 sec
Running org.syncope.core.persistence.relationships.DerSchemaTest
Tests run: 1, Failures: 0, Errors: 0, Skipped: 0, Time elapsed: 0.043 sec
Running org.syncope.core.persistence.relationships.MembershipTest
Tests run: 2, Failures: 0, Errors: 0, Skipped: 0, Time elapsed: 0.126 sec
Running org.syncope.core.persistence.relationships.ResourceTest
Tests run: 3, Failures: 0, Errors: 0, Skipped: 0, Time elapsed: 0.281 sec
Running org.syncope.core.persistence.relationships.UserTest
Tests run: 1, Failures: 0, Errors: 0, Skipped: 0, Time elapsed: 0.087 sec
Running org.syncope.core.persistence.relationships.AttrTest
Tests run: 3, Failures: 0, Errors: 0, Skipped: 0, Time elapsed: 0.106 sec

Results :

Tests run: 19, Failures: 0, Errors: 0, Skipped: 0

[JENKINS] Recording test results
[INFO]
[INFO] --- maven-war-plugin:2.1.1:war (default-war) @ syncope-core ---
[INFO] Packaging webapp
[INFO] Assembling webapp [syncope-core] in [<http://jenkins.syncope-idm.org/job/Syncope%20trunk%20(GNU%20Linux)/ws/core/target/syncope]>
[INFO] Processing war project
[INFO] Copying webapp webResources [<http://jenkins.syncope-idm.org/job/Syncope%20trunk%20(GNU%20Linux)/ws/core/src/main/webapp]> to [<http://jenkins.syncope-idm.org/job/Syncope%20trunk%20(GNU%20Linux)/ws/core/target/syncope]>
[INFO] Copying webapp resources [<http://jenkins.syncope-idm.org/job/Syncope%20trunk%20(GNU%20Linux)/ws/core/src/main/webapp]>
[INFO] Webapp assembled in [605 msecs]
[INFO] Building war: <http://jenkins.syncope-idm.org/job/Syncope%20trunk%20(GNU%20Linux)/ws/core/target/syncope.war>
[INFO] WEB-INF/web.xml already added, skipping
[INFO] Packaging classes
[INFO] Building jar: <http://jenkins.syncope-idm.org/job/Syncope%20trunk%20(GNU%20Linux)/ws/core/target/syncope-classes.jar>
[INFO]
[INFO] --- maven-antrun-plugin:1.6:run (explodeSyncopeWAR) @ syncope-core ---
[INFO] Executing tasks

main:
    [unzip] Expanding: <http://jenkins.syncope-idm.org/job/Syncope%20trunk%20(GNU%20Linux)/ws/core/target/syncope.war> into <http://jenkins.syncope-idm.org/job/Syncope%20trunk%20(GNU%20Linux)/ws/core/target/syncope-core-test>
[INFO] Executed tasks
[INFO]
[INFO] --- maven-antrun-plugin:1.6:run (setupTomcat) @ syncope-core ---
[INFO] Executing tasks

main:
      [get] Destination already exists (skipping): /tmp/apache-tomcat-7.0.22.zip
    [unzip] Expanding: /tmp/apache-tomcat-7.0.22.zip into /tmp
[INFO] Executed tasks
[INFO]
[INFO] --- maven-antrun-plugin:1.6:run (setupCSV) @ syncope-core ---
[INFO] Executing tasks

main:
     [copy] Copying 1 file to /tmp
[INFO] Executed tasks
[INFO]
[INFO] --- maven-enforcer-plugin:1.0:enforce (enforce-maven) @ syncope-core ---
[INFO]
[INFO] --- syncope-build-tools:0.7-SNAPSHOT:set-dynamic-properties (set-dynamic-properties) @ syncope-core ---
[JENKINS] Archiving <http://jenkins.syncope-idm.org/job/Syncope%20trunk%20(GNU%20Linux)/ws/core/pom.xml> to /var/lib/jenkins/jobs/Syncope trunk (GNU Linux)/modules/org.syncope$syncope-core/builds/2011-10-13_11-52-22/archive/org.syncope/syncope-core/0.7-SNAPSHOT/syncope-core-0.7-SNAPSHOT.pom
[JENKINS] Archiving <http://jenkins.syncope-idm.org/job/Syncope%20trunk%20(GNU%20Linux)/ws/core/target/syncope.war> to /var/lib/jenkins/jobs/Syncope trunk (GNU Linux)/modules/org.syncope$syncope-core/builds/2011-10-13_11-52-22/archive/org.syncope/syncope-core/0.7-SNAPSHOT/syncope-core-0.7-SNAPSHOT.war
[JENKINS] Archiving <http://jenkins.syncope-idm.org/job/Syncope%20trunk%20(GNU%20Linux)/ws/core/target/syncope-classes.jar> to /var/lib/jenkins/jobs/Syncope trunk (GNU Linux)/modules/org.syncope$syncope-core/builds/2011-10-13_11-52-22/archive/org.syncope/syncope-core/0.7-SNAPSHOT/syncope-core-0.7-SNAPSHOT-classes.jar
ignoring exception during new ExecutedMojo null
[INFO]
[INFO] --- exec-maven-plugin:1.2.1:java (startTestDb) @ syncope-core ---
Web Console server running at http://192.168.0.1:8082 (only local connections)
TCP server running at tcp://192.168.0.1:9092 (only local connections)
[INFO]
[INFO] --- sql-maven-plugin:1.4:execute (loadTestDb) @ syncope-core ---
[INFO] Executing file: /tmp/testdb.675390361sql
[INFO] 4 of 4 SQL statements executed successfully
[INFO]
[INFO] --- cargo-maven2-plugin:1.1.2:start (start-container) @ syncope-core ---
[INFO] ------------------------------------------------------------------------
[INFO] Reactor Summary:
[INFO]
[INFO] Syncope ........................................... SUCCESS [22.705s]
[INFO] Syncope build tools ............................... SUCCESS [20.418s]
[INFO] Syncope client .................................... SUCCESS [1:05.621s]
[INFO] Syncope core ...................................... FAILURE [4:02.061s]
[INFO] Syncope console ................................... SKIPPED
[INFO] Syncope archetype ................................. SKIPPED
[INFO] ------------------------------------------------------------------------
[INFO] BUILD FAILURE
[INFO] ------------------------------------------------------------------------
[INFO] Total time: 6:14.453s
[INFO] Finished at: Thu Oct 13 11:58:48 CEST 2011
[INFO] Final Memory: 62M/553M
[INFO] ------------------------------------------------------------------------
mavenExecutionResult exceptions not empty
message : Failed to execute goal org.codehaus.cargo:cargo-maven2-plugin:1.1.2:start (start-container) on project syncope-core: Execution start-container of goal org.codehaus.cargo:cargo-maven2-plugin:1.1.2:start failed: Failed to start the Tomcat 7.x container. Check the [<http://jenkins.syncope-idm.org/job/Syncope%20trunk%20(GNU%20Linux)/ws/core/target/log/core-cargo-output.log]> file containing the container logs for more details.
cause : Execution start-container of goal org.codehaus.cargo:cargo-maven2-plugin:1.1.2:start failed: Failed to start the Tomcat 7.x container. Check the [<http://jenkins.syncope-idm.org/job/Syncope%20trunk%20(GNU%20Linux)/ws/core/target/log/core-cargo-output.log]> file containing the container logs for more details.
Stack trace :
org.apache.maven.lifecycle.LifecycleExecutionException: Failed to execute goal org.codehaus.cargo:cargo-maven2-plugin:1.1.2:start (start-container) on project syncope-core: Execution start-container of goal org.codehaus.cargo:cargo-maven2-plugin:1.1.2:start failed: Failed to start the Tomcat 7.x container. Check the [<http://jenkins.syncope-idm.org/job/Syncope%20trunk%20(GNU%20Linux)/ws/core/target/log/core-cargo-output.log]> file containing the container logs for more details.
        at org.apache.maven.lifecycle.internal.MojoExecutor.execute(MojoExecutor.java:225)
        at org.apache.maven.lifecycle.internal.MojoExecutor.execute(MojoExecutor.java:153)
        at org.apache.maven.lifecycle.internal.MojoExecutor.execute(MojoExecutor.java:145)
        at org.apache.maven.lifecycle.internal.LifecycleModuleBuilder.buildProject(LifecycleModuleBuilder.java:84)
        at org.apache.maven.lifecycle.internal.LifecycleModuleBuilder.buildProject(LifecycleModuleBuilder.java:59)
        at org.apache.maven.lifecycle.internal.LifecycleStarter.singleThreadedBuild(LifecycleStarter.java:183)
        at org.apache.maven.lifecycle.internal.LifecycleStarter.execute(LifecycleStarter.java:161)
        at org.apache.maven.DefaultMaven.doExecute(DefaultMaven.java:319)
        at org.apache.maven.DefaultMaven.execute(DefaultMaven.java:156)
        at org.jvnet.hudson.maven3.launcher.Maven3Launcher.main(Maven3Launcher.java:79)
        at sun.reflect.NativeMethodAccessorImpl.invoke0(Native Method)
        at sun.reflect.NativeMethodAccessorImpl.invoke(NativeMethodAccessorImpl.java:39)
        at sun.reflect.DelegatingMethodAccessorImpl.invoke(DelegatingMethodAccessorImpl.java:25)
        at java.lang.reflect.Method.invoke(Method.java:597)
        at org.codehaus.plexus.classworlds.launcher.Launcher.launchStandard(Launcher.java:329)
        at org.codehaus.plexus.classworlds.launcher.Launcher.launch(Launcher.java:239)
        at org.jvnet.hudson.maven3.agent.Maven3Main.launch(Maven3Main.java:158)
        at hudson.maven.Maven3Builder.call(Maven3Builder.java:122)
        at hudson.maven.Maven3Builder.call(Maven3Builder.java:74)
        at hudson.remoting.UserRequest.perform(UserRequest.java:118)
        at hudson.remoting.UserRequest.perform(UserRequest.java:48)
        at hudson.remoting.Request$2.run(Request.java:287)
        at java.util.concurrent.Executors$RunnableAdapter.call(Executors.java:441)
        at java.util.concurrent.FutureTask$Sync.innerRun(FutureTask.java:303)
        at java.util.concurrent.FutureTask.run(FutureTask.java:138)
        at java.util.concurrent.ThreadPoolExecutor$Worker.runTask(ThreadPoolExecutor.java:886)
        at java.util.concurrent.ThreadPoolExecutor$Worker.run(ThreadPoolExecutor.java:908)
        at java.lang.Thread.run(Thread.java:662)
Caused by: org.apache.maven.plugin.PluginExecutionException: Execution start-container of goal org.codehaus.cargo:cargo-maven2-plugin:1.1.2:start failed: Failed to start the Tomcat 7.x container. Check the [<http://jenkins.syncope-idm.org/job/Syncope%20trunk%20(GNU%20Linux)/ws/core/target/log/core-cargo-output.log]> file containing the container logs for more details.
        at org.apache.maven.plugin.DefaultBuildPluginManager.executeMojo(DefaultBuildPluginManager.java:110)
        at org.apache.maven.lifecycle.internal.MojoExecutor.execute(MojoExecutor.java:209)
        ... 27 more
Caused by: org.codehaus.cargo.container.ContainerException: Failed to start the Tomcat 7.x container. Check the [<http://jenkins.syncope-idm.org/job/Syncope%20trunk%20(GNU%20Linux)/ws/core/target/log/core-cargo-output.log]> file containing the container logs for more details.
        at org.codehaus.cargo.container.spi.AbstractLocalContainer.start(AbstractLocalContainer.java:179)
        at org.codehaus.cargo.maven2.AbstractContainerStartMojo.doExecute(AbstractContainerStartMojo.java:55)
        at org.codehaus.cargo.maven2.ContainerStartMojo.doExecute(ContainerStartMojo.java:52)
        at org.codehaus.cargo.maven2.AbstractCargoMojo.execute(AbstractCargoMojo.java:279)
        at org.apache.maven.plugin.DefaultBuildPluginManager.executeMojo(DefaultBuildPluginManager.java:101)
        ... 28 more
Caused by: org.codehaus.cargo.container.ContainerException: Deployable [http://localhost:9080/cargocpc/index.html] failed to finish deploying within the timeout period [120000]. The Deployable state is thus unknown.
        at org.codehaus.cargo.container.spi.deployer.DeployerWatchdog.watch(DeployerWatchdog.java:111)
        at org.codehaus.cargo.container.spi.AbstractLocalContainer.waitForCompletion(AbstractLocalContainer.java:254)
        at org.codehaus.cargo.container.tomcat.internal.AbstractCatalinaInstalledLocalContainer.waitForCompletion(AbstractCatalinaInstalledLocalContainer.java:196)
        at org.codehaus.cargo.container.spi.AbstractLocalContainer.start(AbstractLocalContainer.java:173)
        ... 32 more
[CHECKSTYLE] Aggregating results of Syncope
[CHECKSTYLE] Using set difference to compute new warnings
[CHECKSTYLE] Not changing build status, since no threshold has been exceeded
[CHECKSTYLE] Aggregating results of Syncope build tools
[CHECKSTYLE] Using set difference to compute new warnings
[CHECKSTYLE] Not changing build status, since no threshold has been exceeded
[CHECKSTYLE] Aggregating results of Syncope client
[CHECKSTYLE] Using set difference to compute new warnings
[CHECKSTYLE] Not changing build status, since no threshold has been exceeded
[FINDBUGS] Aggregating results of Syncope
[FINDBUGS] Using set difference to compute new warnings
[FINDBUGS] Not changing build status, since no threshold has been exceeded
[FINDBUGS] Aggregating results of Syncope build tools
[FINDBUGS] Using set difference to compute new warnings
[FINDBUGS] Not changing build status, since no threshold has been exceeded
[FINDBUGS] Aggregating results of Syncope client
[FINDBUGS] Using set difference to compute new warnings
[FINDBUGS] Not changing build status, since no threshold has been exceeded
[PMD] Aggregating results of Syncope
[PMD] Using set difference to compute new warnings
[PMD] Not changing build status, since no threshold has been exceeded
[PMD] Aggregating results of Syncope build tools
[PMD] Using set difference to compute new warnings
[PMD] Not changing build status, since no threshold has been exceeded
[PMD] Aggregating results of Syncope client
[PMD] Using set difference to compute new warnings
[PMD] Not changing build status, since no threshold has been exceeded
Sending e-mails to: [hidden email] [hidden email]
channel stopped

Reply | Threaded
Open this post in threaded view
|

[syncope-dev] Build failed in Jenkins: Syncope trunk (GNU Linux) #59

jenkins
See <http://jenkins.syncope-idm.org/job/Syncope%20trunk%20(GNU%20Linux)/59/>

------------------------------------------
[...truncated 1045 lines...]
Running org.syncope.core.persistence.dao.VirSchemaTest
Tests run: 4, Failures: 0, Errors: 0, Skipped: 0, Time elapsed: 0.048 sec
Running org.syncope.core.persistence.dao.RoleTest
Tests run: 8, Failures: 0, Errors: 0, Skipped: 0, Time elapsed: 0.213 sec
Running org.syncope.core.persistence.dao.VirAttrTest
Tests run: 6, Failures: 0, Errors: 0, Skipped: 0, Time elapsed: 0.102 sec
Running org.syncope.core.persistence.dao.EntitlementTest
Tests run: 4, Failures: 0, Errors: 0, Skipped: 0, Time elapsed: 0.101 sec
Running org.syncope.core.persistence.dao.DerSchemaTest
Tests run: 4, Failures: 0, Errors: 0, Skipped: 0, Time elapsed: 0.048 sec
Running org.syncope.core.persistence.dao.MembershipTest
Tests run: 4, Failures: 0, Errors: 0, Skipped: 0, Time elapsed: 0.093 sec
Running org.syncope.core.persistence.dao.ResourceTest
Tests run: 6, Failures: 0, Errors: 0, Skipped: 0, Time elapsed: 0.143 sec
Running org.syncope.core.persistence.dao.UserSearchTest
Tests run: 7, Failures: 0, Errors: 0, Skipped: 0, Time elapsed: 0.591 sec
Running org.syncope.core.persistence.dao.UserTest
Tests run: 11, Failures: 0, Errors: 0, Skipped: 0, Time elapsed: 0.312 sec
Running org.syncope.core.persistence.dao.AttrTest
Tests run: 7, Failures: 0, Errors: 0, Skipped: 0, Time elapsed: 0.109 sec
Running org.syncope.core.rest.data.ResourceDataBinderTest
Tests run: 2, Failures: 0, Errors: 0, Skipped: 0, Time elapsed: 0.005 sec
Running org.syncope.core.init.ConnInstanceLoaderTest
Tests run: 2, Failures: 0, Errors: 0, Skipped: 0, Time elapsed: 0.237 sec

Results :

Tests run: 97, Failures: 0, Errors: 0, Skipped: 0

[JENKINS] Recording test results
[INFO]
[INFO] --- maven-surefire-plugin:2.9:test (relationship-test-execution) @ syncope-core ---
[INFO] Surefire report directory: <http://jenkins.syncope-idm.org/job/Syncope%20trunk%20(GNU%20Linux)/ws/core/target/surefire-reports>

-------------------------------------------------------
 T E S T S
-------------------------------------------------------
Running org.syncope.core.persistence.relationships.SchemaTest
Tests run: 2, Failures: 0, Errors: 0, Skipped: 0, Time elapsed: 7.558 sec
Running org.syncope.core.persistence.relationships.TaskTest
Tests run: 6, Failures: 0, Errors: 0, Skipped: 0, Time elapsed: 0.311 sec
Running org.syncope.core.persistence.relationships.RoleTest
Tests run: 1, Failures: 0, Errors: 0, Skipped: 0, Time elapsed: 0.087 sec
Running org.syncope.core.persistence.relationships.DerSchemaTest
Tests run: 1, Failures: 0, Errors: 0, Skipped: 0, Time elapsed: 0.044 sec
Running org.syncope.core.persistence.relationships.MembershipTest
Tests run: 2, Failures: 0, Errors: 0, Skipped: 0, Time elapsed: 0.127 sec
Running org.syncope.core.persistence.relationships.ResourceTest
Tests run: 3, Failures: 0, Errors: 0, Skipped: 0, Time elapsed: 0.225 sec
Running org.syncope.core.persistence.relationships.UserTest
Tests run: 1, Failures: 0, Errors: 0, Skipped: 0, Time elapsed: 0.071 sec
Running org.syncope.core.persistence.relationships.AttrTest
Tests run: 3, Failures: 0, Errors: 0, Skipped: 0, Time elapsed: 0.103 sec

Results :

Tests run: 19, Failures: 0, Errors: 0, Skipped: 0

[JENKINS] Recording test results
[INFO]
[INFO] --- maven-war-plugin:2.1.1:war (default-war) @ syncope-core ---
[INFO] Packaging webapp
[INFO] Assembling webapp [syncope-core] in [<http://jenkins.syncope-idm.org/job/Syncope%20trunk%20(GNU%20Linux)/ws/core/target/syncope]>
[INFO] Processing war project
[INFO] Copying webapp webResources [<http://jenkins.syncope-idm.org/job/Syncope%20trunk%20(GNU%20Linux)/ws/core/src/main/webapp]> to [<http://jenkins.syncope-idm.org/job/Syncope%20trunk%20(GNU%20Linux)/ws/core/target/syncope]>
[INFO] Copying webapp resources [<http://jenkins.syncope-idm.org/job/Syncope%20trunk%20(GNU%20Linux)/ws/core/src/main/webapp]>
[INFO] Webapp assembled in [263 msecs]
[INFO] Building war: <http://jenkins.syncope-idm.org/job/Syncope%20trunk%20(GNU%20Linux)/ws/core/target/syncope.war>
[INFO] WEB-INF/web.xml already added, skipping
[INFO] Packaging classes
[INFO] Building jar: <http://jenkins.syncope-idm.org/job/Syncope%20trunk%20(GNU%20Linux)/ws/core/target/syncope-classes.jar>
[INFO]
[INFO] --- maven-antrun-plugin:1.6:run (explodeSyncopeWAR) @ syncope-core ---
[INFO] Executing tasks

main:
    [unzip] Expanding: <http://jenkins.syncope-idm.org/job/Syncope%20trunk%20(GNU%20Linux)/ws/core/target/syncope.war> into <http://jenkins.syncope-idm.org/job/Syncope%20trunk%20(GNU%20Linux)/ws/core/target/syncope-core-test>
[INFO] Executed tasks
[INFO]
[INFO] --- maven-antrun-plugin:1.6:run (setupTomcat) @ syncope-core ---
[INFO] Executing tasks

main:
      [get] Destination already exists (skipping): /tmp/apache-tomcat-7.0.22.zip
    [unzip] Expanding: /tmp/apache-tomcat-7.0.22.zip into /tmp
[INFO] Executed tasks
[INFO]
[INFO] --- maven-antrun-plugin:1.6:run (setupCSV) @ syncope-core ---
[INFO] Executing tasks

main:
     [copy] Copying 1 file to /tmp
[INFO] Executed tasks
[INFO]
[INFO] --- maven-enforcer-plugin:1.0:enforce (enforce-maven) @ syncope-core ---
[INFO]
[INFO] --- syncope-build-tools:0.7-SNAPSHOT:set-dynamic-properties (set-dynamic-properties) @ syncope-core ---
[JENKINS] Archiving <http://jenkins.syncope-idm.org/job/Syncope%20trunk%20(GNU%20Linux)/ws/core/pom.xml> to /var/lib/jenkins/jobs/Syncope trunk (GNU Linux)/modules/org.syncope$syncope-core/builds/2011-10-13_12-04-20/archive/org.syncope/syncope-core/0.7-SNAPSHOT/syncope-core-0.7-SNAPSHOT.pom
[JENKINS] Archiving <http://jenkins.syncope-idm.org/job/Syncope%20trunk%20(GNU%20Linux)/ws/core/target/syncope.war> to /var/lib/jenkins/jobs/Syncope trunk (GNU Linux)/modules/org.syncope$syncope-core/builds/2011-10-13_12-04-20/archive/org.syncope/syncope-core/0.7-SNAPSHOT/syncope-core-0.7-SNAPSHOT.war
[JENKINS] Archiving <http://jenkins.syncope-idm.org/job/Syncope%20trunk%20(GNU%20Linux)/ws/core/target/syncope-classes.jar> to /var/lib/jenkins/jobs/Syncope trunk (GNU Linux)/modules/org.syncope$syncope-core/builds/2011-10-13_12-04-20/archive/org.syncope/syncope-core/0.7-SNAPSHOT/syncope-core-0.7-SNAPSHOT-classes.jar
ignoring exception during new ExecutedMojo null
[INFO]
[INFO] --- exec-maven-plugin:1.2.1:java (startTestDb) @ syncope-core ---
Web Console server running at http://192.168.0.1:8082 (only local connections)
TCP server running at tcp://192.168.0.1:9092 (only local connections)
[INFO]
[INFO] --- sql-maven-plugin:1.4:execute (loadTestDb) @ syncope-core ---
[INFO] Executing file: /tmp/testdb.1731279427sql
[INFO] 4 of 4 SQL statements executed successfully
[INFO]
[INFO] --- cargo-maven2-plugin:1.1.2:start (start-container) @ syncope-core ---
[INFO]
[INFO] --- maven-failsafe-plugin:2.9:integration-test (default) @ syncope-core ---
[INFO] Failsafe report directory: <http://jenkins.syncope-idm.org/job/Syncope%20trunk%20(GNU%20Linux)/ws/core/target/failsafe-reports>

-------------------------------------------------------
 T E S T S
-------------------------------------------------------
Running org.syncope.core.rest.TaskTestITCase
Tests run: 10, Failures: 0, Errors: 0, Skipped: 0, Time elapsed: 18.145 sec
Running org.syncope.core.rest.AuthenticationTestITCase
Tests run: 4, Failures: 0, Errors: 0, Skipped: 0, Time elapsed: 1.207 sec
Running org.syncope.core.rest.UserTestITCase
Tests run: 22, Failures: 0, Errors: 0, Skipped: 0, Time elapsed: 5.709 sec
Running org.syncope.core.rest.PolicyTestITCase
Tests run: 9, Failures: 0, Errors: 1, Skipped: 0, Time elapsed: 0.602 sec <<< FAILURE!
Running org.syncope.core.rest.SchemaTestITCase
Tests run: 4, Failures: 0, Errors: 0, Skipped: 0, Time elapsed: 0.683 sec
Running org.syncope.core.rest.LogTestITCase
Tests run: 1, Failures: 0, Errors: 0, Skipped: 0, Time elapsed: 0.089 sec
Running org.syncope.core.rest.ConfigurationTestITCase
Tests run: 5, Failures: 0, Errors: 0, Skipped: 0, Time elapsed: 0.484 sec
Running org.syncope.core.rest.DerivedSchemaTestITCase
Tests run: 5, Failures: 0, Errors: 0, Skipped: 0, Time elapsed: 0.493 sec
Running org.syncope.core.rest.RoleTestITCase
Tests run: 10, Failures: 0, Errors: 0, Skipped: 0, Time elapsed: 0.851 sec
Running org.syncope.core.rest.ResourceTestITCase
Tests run: 13, Failures: 0, Errors: 0, Skipped: 0, Time elapsed: 0.956 sec
Running org.syncope.core.rest.ConnInstanceTestITCase
Tests run: 10, Failures: 0, Errors: 0, Skipped: 0, Time elapsed: 1.024 sec
Running org.syncope.core.rest.VirtualSchemaTestITCase
Tests run: 4, Failures: 0, Errors: 0, Skipped: 0, Time elapsed: 0.344 sec

Results :

Tests in error:
  update(org.syncope.core.rest.PolicyTestITCase): {[NotFound [Policy 2 not found]], }

Tests run: 97, Failures: 0, Errors: 1, Skipped: 0

[JENKINS] Recording test results
[INFO]
[INFO] --- cargo-maven2-plugin:1.1.2:stop (stop-container) @ syncope-core ---
[INFO]
[INFO] --- maven-failsafe-plugin:2.9:verify (default) @ syncope-core ---
[INFO] Failsafe report directory: <http://jenkins.syncope-idm.org/job/Syncope%20trunk%20(GNU%20Linux)/ws/core/target/failsafe-reports>
[INFO] ------------------------------------------------------------------------
[INFO] Reactor Summary:
[INFO]
[INFO] Syncope ........................................... SUCCESS [16.320s]
[INFO] Syncope build tools ............................... SUCCESS [19.519s]
[INFO] Syncope client .................................... SUCCESS [24.262s]
[INFO] Syncope core ...................................... FAILURE [1:37.988s]
[INFO] Syncope console ................................... SKIPPED
[INFO] Syncope archetype ................................. SKIPPED
[INFO] ------------------------------------------------------------------------
[INFO] BUILD FAILURE
[INFO] ------------------------------------------------------------------------
[INFO] Total time: 2:48.039s
[INFO] Finished at: Thu Oct 13 12:07:16 CEST 2011
[INFO] Final Memory: 59M/482M
[INFO] ------------------------------------------------------------------------
mavenExecutionResult exceptions not empty
message : Failed to execute goal org.apache.maven.plugins:maven-failsafe-plugin:2.9:verify (default) on project syncope-core: There are test failures.

Please refer to <http://jenkins.syncope-idm.org/job/Syncope%20trunk%20(GNU%20Linux)/ws/core/target/failsafe-reports> for the individual test results.
cause : There are test failures.

Please refer to <http://jenkins.syncope-idm.org/job/Syncope%20trunk%20(GNU%20Linux)/ws/core/target/failsafe-reports> for the individual test results.
Stack trace :
org.apache.maven.lifecycle.LifecycleExecutionException: Failed to execute goal org.apache.maven.plugins:maven-failsafe-plugin:2.9:verify (default) on project syncope-core: There are test failures.

Please refer to <http://jenkins.syncope-idm.org/job/Syncope%20trunk%20(GNU%20Linux)/ws/core/target/failsafe-reports> for the individual test results.
        at org.apache.maven.lifecycle.internal.MojoExecutor.execute(MojoExecutor.java:213)
        at org.apache.maven.lifecycle.internal.MojoExecutor.execute(MojoExecutor.java:153)
        at org.apache.maven.lifecycle.internal.MojoExecutor.execute(MojoExecutor.java:145)
        at org.apache.maven.lifecycle.internal.LifecycleModuleBuilder.buildProject(LifecycleModuleBuilder.java:84)
        at org.apache.maven.lifecycle.internal.LifecycleModuleBuilder.buildProject(LifecycleModuleBuilder.java:59)
        at org.apache.maven.lifecycle.internal.LifecycleStarter.singleThreadedBuild(LifecycleStarter.java:183)
        at org.apache.maven.lifecycle.internal.LifecycleStarter.execute(LifecycleStarter.java:161)
        at org.apache.maven.DefaultMaven.doExecute(DefaultMaven.java:319)
        at org.apache.maven.DefaultMaven.execute(DefaultMaven.java:156)
        at org.jvnet.hudson.maven3.launcher.Maven3Launcher.main(Maven3Launcher.java:79)
        at sun.reflect.NativeMethodAccessorImpl.invoke0(Native Method)
        at sun.reflect.NativeMethodAccessorImpl.invoke(NativeMethodAccessorImpl.java:39)
        at sun.reflect.DelegatingMethodAccessorImpl.invoke(DelegatingMethodAccessorImpl.java:25)
        at java.lang.reflect.Method.invoke(Method.java:597)
        at org.codehaus.plexus.classworlds.launcher.Launcher.launchStandard(Launcher.java:329)
        at org.codehaus.plexus.classworlds.launcher.Launcher.launch(Launcher.java:239)
        at org.jvnet.hudson.maven3.agent.Maven3Main.launch(Maven3Main.java:158)
        at hudson.maven.Maven3Builder.call(Maven3Builder.java:122)
        at hudson.maven.Maven3Builder.call(Maven3Builder.java:74)
        at hudson.remoting.UserRequest.perform(UserRequest.java:118)
        at hudson.remoting.UserRequest.perform(UserRequest.java:48)
        at hudson.remoting.Request$2.run(Request.java:287)
        at java.util.concurrent.Executors$RunnableAdapter.call(Executors.java:441)
        at java.util.concurrent.FutureTask$Sync.innerRun(FutureTask.java:303)
        at java.util.concurrent.FutureTask.run(FutureTask.java:138)
        at java.util.concurrent.ThreadPoolExecutor$Worker.runTask(ThreadPoolExecutor.java:886)
        at java.util.concurrent.ThreadPoolExecutor$Worker.run(ThreadPoolExecutor.java:908)
        at java.lang.Thread.run(Thread.java:662)
Caused by: org.apache.maven.plugin.MojoFailureException: There are test failures.

Please refer to <http://jenkins.syncope-idm.org/job/Syncope%20trunk%20(GNU%20Linux)/ws/core/target/failsafe-reports> for the individual test results.
        at org.apache.maven.plugin.surefire.SurefireHelper.reportExecution(SurefireHelper.java:126)
        at org.apache.maven.plugin.failsafe.VerifyMojo.execute(VerifyMojo.java:208)
        at org.apache.maven.plugin.DefaultBuildPluginManager.executeMojo(DefaultBuildPluginManager.java:101)
        at org.apache.maven.lifecycle.internal.MojoExecutor.execute(MojoExecutor.java:209)
        ... 27 more
Maven failed with error.
[CHECKSTYLE] Aggregating results of Syncope
[CHECKSTYLE] Using set difference to compute new warnings
[CHECKSTYLE] Not changing build status, since no threshold has been exceeded
[CHECKSTYLE] Aggregating results of Syncope build tools
[CHECKSTYLE] Using set difference to compute new warnings
[CHECKSTYLE] Not changing build status, since no threshold has been exceeded
[CHECKSTYLE] Aggregating results of Syncope client
[CHECKSTYLE] Using set difference to compute new warnings
[CHECKSTYLE] Not changing build status, since no threshold has been exceeded
[FINDBUGS] Aggregating results of Syncope
[FINDBUGS] Using set difference to compute new warnings
[FINDBUGS] Not changing build status, since no threshold has been exceeded
[FINDBUGS] Aggregating results of Syncope build tools
[FINDBUGS] Using set difference to compute new warnings
[FINDBUGS] Not changing build status, since no threshold has been exceeded
[FINDBUGS] Aggregating results of Syncope client
[FINDBUGS] Using set difference to compute new warnings
[FINDBUGS] Not changing build status, since no threshold has been exceeded
[PMD] Aggregating results of Syncope
[PMD] Using set difference to compute new warnings
[PMD] Not changing build status, since no threshold has been exceeded
[PMD] Aggregating results of Syncope build tools
[PMD] Using set difference to compute new warnings
[PMD] Not changing build status, since no threshold has been exceeded
[PMD] Aggregating results of Syncope client
[PMD] Using set difference to compute new warnings
[PMD] Not changing build status, since no threshold has been exceeded
Sending e-mails to: [hidden email]
channel stopped

Reply | Threaded
Open this post in threaded view
|

[syncope-dev] Build failed in Jenkins: Syncope trunk (GNU Linux) #60

jenkins
See <http://jenkins.syncope-idm.org/job/Syncope%20trunk%20(GNU%20Linux)/60/>

------------------------------------------
[...truncated 1046 lines...]
Running org.syncope.core.persistence.dao.VirSchemaTest
Tests run: 4, Failures: 0, Errors: 0, Skipped: 0, Time elapsed: 0.074 sec
Running org.syncope.core.persistence.dao.RoleTest
Tests run: 8, Failures: 0, Errors: 0, Skipped: 0, Time elapsed: 0.253 sec
Running org.syncope.core.persistence.dao.VirAttrTest
Tests run: 6, Failures: 0, Errors: 0, Skipped: 0, Time elapsed: 0.124 sec
Running org.syncope.core.persistence.dao.EntitlementTest
Tests run: 4, Failures: 0, Errors: 0, Skipped: 0, Time elapsed: 0.112 sec
Running org.syncope.core.persistence.dao.DerSchemaTest
Tests run: 4, Failures: 0, Errors: 0, Skipped: 0, Time elapsed: 0.049 sec
Running org.syncope.core.persistence.dao.MembershipTest
Tests run: 4, Failures: 0, Errors: 0, Skipped: 0, Time elapsed: 0.104 sec
Running org.syncope.core.persistence.dao.ResourceTest
Tests run: 6, Failures: 0, Errors: 0, Skipped: 0, Time elapsed: 0.151 sec
Running org.syncope.core.persistence.dao.UserSearchTest
Tests run: 7, Failures: 0, Errors: 0, Skipped: 0, Time elapsed: 0.636 sec
Running org.syncope.core.persistence.dao.UserTest
Tests run: 11, Failures: 0, Errors: 0, Skipped: 0, Time elapsed: 0.357 sec
Running org.syncope.core.persistence.dao.AttrTest
Tests run: 7, Failures: 0, Errors: 0, Skipped: 0, Time elapsed: 0.127 sec
Running org.syncope.core.rest.data.ResourceDataBinderTest
Tests run: 2, Failures: 0, Errors: 0, Skipped: 0, Time elapsed: 0.008 sec
Running org.syncope.core.init.ConnInstanceLoaderTest
Tests run: 2, Failures: 0, Errors: 0, Skipped: 0, Time elapsed: 0.23 sec

Results :

Tests run: 97, Failures: 0, Errors: 0, Skipped: 0

[JENKINS] Recording test results
[INFO] [INFO] Surefire report directory: <http://jenkins.syncope-idm.org/job/Syncope%20trunk%20(GNU%20Linux)/ws/core/target/surefire-reports>

-------------------------------------------------------
 T E S T S
-------------------------------------------------------

[INFO] --- maven-surefire-plugin:2.9:test (relationship-test-execution) @ syncope-core ---
Running org.syncope.core.persistence.relationships.SchemaTest
Tests run: 2, Failures: 0, Errors: 0, Skipped: 0, Time elapsed: 7.468 sec
Running org.syncope.core.persistence.relationships.TaskTest
Tests run: 6, Failures: 0, Errors: 0, Skipped: 0, Time elapsed: 0.291 sec
Running org.syncope.core.persistence.relationships.RoleTest
Tests run: 1, Failures: 0, Errors: 0, Skipped: 0, Time elapsed: 0.087 sec
Running org.syncope.core.persistence.relationships.DerSchemaTest
Tests run: 1, Failures: 0, Errors: 0, Skipped: 0, Time elapsed: 0.042 sec
Running org.syncope.core.persistence.relationships.MembershipTest
Tests run: 2, Failures: 0, Errors: 0, Skipped: 0, Time elapsed: 0.125 sec
Running org.syncope.core.persistence.relationships.ResourceTest
Tests run: 3, Failures: 0, Errors: 0, Skipped: 0, Time elapsed: 0.224 sec
Running org.syncope.core.persistence.relationships.UserTest
Tests run: 1, Failures: 0, Errors: 0, Skipped: 0, Time elapsed: 0.087 sec
Running org.syncope.core.persistence.relationships.AttrTest
Tests run: 3, Failures: 0, Errors: 0, Skipped: 0, Time elapsed: 0.093 sec

Results :

Tests run: 19, Failures: 0, Errors: 0, Skipped: 0

[JENKINS] Recording test results
[INFO]
[INFO] --- maven-war-plugin:2.1.1:war (default-war) @ syncope-core ---
[INFO] Packaging webapp
[INFO] Assembling webapp [syncope-core] in [<http://jenkins.syncope-idm.org/job/Syncope%20trunk%20(GNU%20Linux)/ws/core/target/syncope]>
[INFO] Processing war project
[INFO] Copying webapp webResources [<http://jenkins.syncope-idm.org/job/Syncope%20trunk%20(GNU%20Linux)/ws/core/src/main/webapp]> to [<http://jenkins.syncope-idm.org/job/Syncope%20trunk%20(GNU%20Linux)/ws/core/target/syncope]>
[INFO] Copying webapp resources [<http://jenkins.syncope-idm.org/job/Syncope%20trunk%20(GNU%20Linux)/ws/core/src/main/webapp]>
[INFO] Webapp assembled in [304 msecs]
[INFO] Building war: <http://jenkins.syncope-idm.org/job/Syncope%20trunk%20(GNU%20Linux)/ws/core/target/syncope.war>
[INFO] WEB-INF/web.xml already added, skipping
[INFO] Packaging classes
[INFO] Building jar: <http://jenkins.syncope-idm.org/job/Syncope%20trunk%20(GNU%20Linux)/ws/core/target/syncope-classes.jar>
[INFO]
[INFO] --- maven-antrun-plugin:1.6:run (explodeSyncopeWAR) @ syncope-core ---
[INFO] Executing tasks

main:
    [unzip] Expanding: <http://jenkins.syncope-idm.org/job/Syncope%20trunk%20(GNU%20Linux)/ws/core/target/syncope.war> into <http://jenkins.syncope-idm.org/job/Syncope%20trunk%20(GNU%20Linux)/ws/core/target/syncope-core-test>
[INFO] Executed tasks
[INFO]
[INFO] --- maven-antrun-plugin:1.6:run (setupTomcat) @ syncope-core ---
[INFO] Executing tasks

main:
      [get] Destination already exists (skipping): /tmp/apache-tomcat-7.0.22.zip
    [unzip] Expanding: /tmp/apache-tomcat-7.0.22.zip into /tmp
[INFO] Executed tasks
[INFO]
[INFO] --- maven-antrun-plugin:1.6:run (setupCSV) @ syncope-core ---
[INFO] Executing tasks

main:
     [copy] Copying 1 file to /tmp
[INFO] Executed tasks
[INFO]
[INFO] --- maven-enforcer-plugin:1.0:enforce (enforce-maven) @ syncope-core ---
[INFO]
[INFO] --- syncope-build-tools:0.7-SNAPSHOT:set-dynamic-properties (set-dynamic-properties) @ syncope-core ---
[JENKINS] Archiving <http://jenkins.syncope-idm.org/job/Syncope%20trunk%20(GNU%20Linux)/ws/core/pom.xml> to /var/lib/jenkins/jobs/Syncope trunk (GNU Linux)/modules/org.syncope$syncope-core/builds/2011-10-13_17-51-47/archive/org.syncope/syncope-core/0.7-SNAPSHOT/syncope-core-0.7-SNAPSHOT.pom
[JENKINS] Archiving <http://jenkins.syncope-idm.org/job/Syncope%20trunk%20(GNU%20Linux)/ws/core/target/syncope.war> to /var/lib/jenkins/jobs/Syncope trunk (GNU Linux)/modules/org.syncope$syncope-core/builds/2011-10-13_17-51-47/archive/org.syncope/syncope-core/0.7-SNAPSHOT/syncope-core-0.7-SNAPSHOT.war
[JENKINS] Archiving <http://jenkins.syncope-idm.org/job/Syncope%20trunk%20(GNU%20Linux)/ws/core/target/syncope-classes.jar> to /var/lib/jenkins/jobs/Syncope trunk (GNU Linux)/modules/org.syncope$syncope-core/builds/2011-10-13_17-51-47/archive/org.syncope/syncope-core/0.7-SNAPSHOT/syncope-core-0.7-SNAPSHOT-classes.jar
ignoring exception during new ExecutedMojo null
[INFO]
[INFO] --- exec-maven-plugin:1.2.1:java (startTestDb) @ syncope-core ---
Web Console server running at http://192.168.0.1:8082 (only local connections)
TCP server running at tcp://192.168.0.1:9092 (only local connections)
[INFO]
[INFO] --- sql-maven-plugin:1.4:execute (loadTestDb) @ syncope-core ---
[INFO] Executing file: /tmp/testdb.649729016sql
[INFO] 4 of 4 SQL statements executed successfully
[INFO]
[INFO] --- cargo-maven2-plugin:1.1.2:start (start-container) @ syncope-core ---
[INFO]
[INFO] --- maven-failsafe-plugin:2.9:integration-test (default) @ syncope-core ---
[INFO] Failsafe report directory: <http://jenkins.syncope-idm.org/job/Syncope%20trunk%20(GNU%20Linux)/ws/core/target/failsafe-reports>

-------------------------------------------------------
 T E S T S
-------------------------------------------------------
Running org.syncope.core.rest.TaskTestITCase
Tests run: 10, Failures: 0, Errors: 0, Skipped: 0, Time elapsed: 18.793 sec
Running org.syncope.core.rest.AuthenticationTestITCase
Tests run: 4, Failures: 0, Errors: 0, Skipped: 0, Time elapsed: 1.557 sec
Running org.syncope.core.rest.UserTestITCase
Tests run: 22, Failures: 0, Errors: 0, Skipped: 0, Time elapsed: 5.572 sec
Running org.syncope.core.rest.PolicyTestITCase
Tests run: 9, Failures: 0, Errors: 1, Skipped: 0, Time elapsed: 0.624 sec <<< FAILURE!
Running org.syncope.core.rest.SchemaTestITCase
Tests run: 4, Failures: 0, Errors: 0, Skipped: 0, Time elapsed: 0.634 sec
Running org.syncope.core.rest.LogTestITCase
Tests run: 1, Failures: 0, Errors: 0, Skipped: 0, Time elapsed: 0.092 sec
Running org.syncope.core.rest.ConfigurationTestITCase
Tests run: 5, Failures: 0, Errors: 0, Skipped: 0, Time elapsed: 0.468 sec
Running org.syncope.core.rest.DerivedSchemaTestITCase
Tests run: 5, Failures: 0, Errors: 0, Skipped: 0, Time elapsed: 0.507 sec
Running org.syncope.core.rest.RoleTestITCase
Tests run: 10, Failures: 0, Errors: 0, Skipped: 0, Time elapsed: 0.886 sec
Running org.syncope.core.rest.ResourceTestITCase
Tests run: 13, Failures: 0, Errors: 0, Skipped: 0, Time elapsed: 1.074 sec
Running org.syncope.core.rest.ConnInstanceTestITCase
Tests run: 10, Failures: 0, Errors: 0, Skipped: 0, Time elapsed: 1.098 sec
Running org.syncope.core.rest.VirtualSchemaTestITCase
Tests run: 4, Failures: 0, Errors: 0, Skipped: 0, Time elapsed: 0.392 sec

Results :

Tests in error:
  update(org.syncope.core.rest.PolicyTestITCase): {[NotFound [Policy 2 not found]], }

Tests run: 97, Failures: 0, Errors: 1, Skipped: 0

[JENKINS] Recording test results
[INFO]
[INFO] --- cargo-maven2-plugin:1.1.2:stop (stop-container) @ syncope-core ---
[INFO]
[INFO] --- maven-failsafe-plugin:2.9:verify (default) @ syncope-core ---
[INFO] Failsafe report directory: <http://jenkins.syncope-idm.org/job/Syncope%20trunk%20(GNU%20Linux)/ws/core/target/failsafe-reports>
[INFO] ------------------------------------------------------------------------
[INFO] Reactor Summary:
[INFO]
[INFO] Syncope ........................................... SUCCESS [4.217s]
[INFO] Syncope build tools ............................... SUCCESS [10.061s]
[INFO] Syncope client .................................... SUCCESS [20.934s]
[INFO] Syncope core ...................................... FAILURE [1:33.796s]
[INFO] Syncope console ................................... SKIPPED
[INFO] Syncope archetype ................................. SKIPPED
[INFO] ------------------------------------------------------------------------
[INFO] BUILD FAILURE
[INFO] ------------------------------------------------------------------------
[INFO] Total time: 2:13.295s
[INFO] Finished at: Thu Oct 13 17:54:04 CEST 2011
[INFO] Final Memory: 61M/575M
[INFO] ------------------------------------------------------------------------
mavenExecutionResult exceptions not empty
message : Failed to execute goal org.apache.maven.plugins:maven-failsafe-plugin:2.9:verify (default) on project syncope-core: There are test failures.

Please refer to <http://jenkins.syncope-idm.org/job/Syncope%20trunk%20(GNU%20Linux)/ws/core/target/failsafe-reports> for the individual test results.
cause : There are test failures.

Please refer to <http://jenkins.syncope-idm.org/job/Syncope%20trunk%20(GNU%20Linux)/ws/core/target/failsafe-reports> for the individual test results.
Stack trace :
org.apache.maven.lifecycle.LifecycleExecutionException: Failed to execute goal org.apache.maven.plugins:maven-failsafe-plugin:2.9:verify (default) on project syncope-core: There are test failures.

Please refer to <http://jenkins.syncope-idm.org/job/Syncope%20trunk%20(GNU%20Linux)/ws/core/target/failsafe-reports> for the individual test results.
        at org.apache.maven.lifecycle.internal.MojoExecutor.execute(MojoExecutor.java:213)
        at org.apache.maven.lifecycle.internal.MojoExecutor.execute(MojoExecutor.java:153)
        at org.apache.maven.lifecycle.internal.MojoExecutor.execute(MojoExecutor.java:145)
        at org.apache.maven.lifecycle.internal.LifecycleModuleBuilder.buildProject(LifecycleModuleBuilder.java:84)
        at org.apache.maven.lifecycle.internal.LifecycleModuleBuilder.buildProject(LifecycleModuleBuilder.java:59)
        at org.apache.maven.lifecycle.internal.LifecycleStarter.singleThreadedBuild(LifecycleStarter.java:183)
        at org.apache.maven.lifecycle.internal.LifecycleStarter.execute(LifecycleStarter.java:161)
        at org.apache.maven.DefaultMaven.doExecute(DefaultMaven.java:319)
        at org.apache.maven.DefaultMaven.execute(DefaultMaven.java:156)
        at org.jvnet.hudson.maven3.launcher.Maven3Launcher.main(Maven3Launcher.java:79)
        at sun.reflect.NativeMethodAccessorImpl.invoke0(Native Method)
        at sun.reflect.NativeMethodAccessorImpl.invoke(NativeMethodAccessorImpl.java:39)
        at sun.reflect.DelegatingMethodAccessorImpl.invoke(DelegatingMethodAccessorImpl.java:25)
        at java.lang.reflect.Method.invoke(Method.java:597)
        at org.codehaus.plexus.classworlds.launcher.Launcher.launchStandard(Launcher.java:329)
        at org.codehaus.plexus.classworlds.launcher.Launcher.launch(Launcher.java:239)
        at org.jvnet.hudson.maven3.agent.Maven3Main.launch(Maven3Main.java:158)
        at hudson.maven.Maven3Builder.call(Maven3Builder.java:122)
        at hudson.maven.Maven3Builder.call(Maven3Builder.java:74)
        at hudson.remoting.UserRequest.perform(UserRequest.java:118)
        at hudson.remoting.UserRequest.perform(UserRequest.java:48)
        at hudson.remoting.Request$2.run(Request.java:287)
        at java.util.concurrent.Executors$RunnableAdapter.call(Executors.java:441)
        at java.util.concurrent.FutureTask$Sync.innerRun(FutureTask.java:303)
        at java.util.concurrent.FutureTask.run(FutureTask.java:138)
        at java.util.concurrent.ThreadPoolExecutor$Worker.runTask(ThreadPoolExecutor.java:886)
        at java.util.concurrent.ThreadPoolExecutor$Worker.run(ThreadPoolExecutor.java:908)
        at java.lang.Thread.run(Thread.java:662)
Caused by: org.apache.maven.plugin.MojoFailureException: There are test failures.

Please refer to <http://jenkins.syncope-idm.org/job/Syncope%20trunk%20(GNU%20Linux)/ws/core/target/failsafe-reports> for the individual test results.
        at org.apache.maven.plugin.surefire.SurefireHelper.reportExecution(SurefireHelper.java:126)
        at org.apache.maven.plugin.failsafe.VerifyMojo.execute(VerifyMojo.java:208)
        at org.apache.maven.plugin.DefaultBuildPluginManager.executeMojo(DefaultBuildPluginManager.java:101)
        at org.apache.maven.lifecycle.internal.MojoExecutor.execute(MojoExecutor.java:209)
        ... 27 more
Maven failed with error.
[CHECKSTYLE] Aggregating results of Syncope
[CHECKSTYLE] Using set difference to compute new warnings
[CHECKSTYLE] Not changing build status, since no threshold has been exceeded
[CHECKSTYLE] Aggregating results of Syncope build tools
[CHECKSTYLE] Using set difference to compute new warnings
[CHECKSTYLE] Not changing build status, since no threshold has been exceeded
[CHECKSTYLE] Aggregating results of Syncope client
[CHECKSTYLE] Using set difference to compute new warnings
[CHECKSTYLE] Not changing build status, since no threshold has been exceeded
[FINDBUGS] Aggregating results of Syncope
[FINDBUGS] Using set difference to compute new warnings
[FINDBUGS] Not changing build status, since no threshold has been exceeded
[FINDBUGS] Aggregating results of Syncope build tools
[FINDBUGS] Using set difference to compute new warnings
[FINDBUGS] Not changing build status, since no threshold has been exceeded
[FINDBUGS] Aggregating results of Syncope client
[FINDBUGS] Using set difference to compute new warnings
[FINDBUGS] Not changing build status, since no threshold has been exceeded
[PMD] Aggregating results of Syncope
[PMD] Using set difference to compute new warnings
[PMD] Not changing build status, since no threshold has been exceeded
[PMD] Aggregating results of Syncope build tools
[PMD] Using set difference to compute new warnings
[PMD] Not changing build status, since no threshold has been exceeded
[PMD] Aggregating results of Syncope client
[PMD] Using set difference to compute new warnings
[PMD] Not changing build status, since no threshold has been exceeded
Sending e-mails to: [hidden email]
channel stopped

Reply | Threaded
Open this post in threaded view
|

[syncope-dev] Build failed in Jenkins: Syncope trunk (GNU Linux) #61

jenkins
See <http://jenkins.syncope-idm.org/job/Syncope%20trunk%20(GNU%20Linux)/61/>

------------------------------------------
[...truncated 1046 lines...]
Running org.syncope.core.persistence.dao.VirSchemaTest
Tests run: 4, Failures: 0, Errors: 0, Skipped: 0, Time elapsed: 0.052 sec
Running org.syncope.core.persistence.dao.RoleTest
Tests run: 8, Failures: 0, Errors: 0, Skipped: 0, Time elapsed: 0.229 sec
Running org.syncope.core.persistence.dao.VirAttrTest
Tests run: 6, Failures: 0, Errors: 0, Skipped: 0, Time elapsed: 0.113 sec
Running org.syncope.core.persistence.dao.EntitlementTest
Tests run: 4, Failures: 0, Errors: 0, Skipped: 0, Time elapsed: 0.109 sec
Running org.syncope.core.persistence.dao.DerSchemaTest
Tests run: 4, Failures: 0, Errors: 0, Skipped: 0, Time elapsed: 0.048 sec
Running org.syncope.core.persistence.dao.MembershipTest
Tests run: 4, Failures: 0, Errors: 0, Skipped: 0, Time elapsed: 0.091 sec
Running org.syncope.core.persistence.dao.ResourceTest
Tests run: 6, Failures: 0, Errors: 0, Skipped: 0, Time elapsed: 0.149 sec
Running org.syncope.core.persistence.dao.UserSearchTest
Tests run: 7, Failures: 0, Errors: 0, Skipped: 0, Time elapsed: 0.595 sec
Running org.syncope.core.persistence.dao.UserTest
Tests run: 11, Failures: 0, Errors: 0, Skipped: 0, Time elapsed: 0.353 sec
Running org.syncope.core.persistence.dao.AttrTest
Tests run: 7, Failures: 0, Errors: 0, Skipped: 0, Time elapsed: 0.119 sec
Running org.syncope.core.rest.data.ResourceDataBinderTest
Tests run: 2, Failures: 0, Errors: 0, Skipped: 0, Time elapsed: 0.005 sec
Running org.syncope.core.init.ConnInstanceLoaderTest
Tests run: 2, Failures: 0, Errors: 0, Skipped: 0, Time elapsed: 0.221 sec

Results :

Tests run: 97, Failures: 0, Errors: 0, Skipped: 0

[JENKINS] Recording test results
[INFO]
[INFO] --- maven-surefire-plugin:2.9:test (relationship-test-execution) @ syncope-core ---
[INFO] Surefire report directory: <http://jenkins.syncope-idm.org/job/Syncope%20trunk%20(GNU%20Linux)/ws/core/target/surefire-reports>

-------------------------------------------------------
 T E S T S
-------------------------------------------------------
Running org.syncope.core.persistence.relationships.SchemaTest
Tests run: 2, Failures: 0, Errors: 0, Skipped: 0, Time elapsed: 7.231 sec
Running org.syncope.core.persistence.relationships.TaskTest
Tests run: 6, Failures: 0, Errors: 0, Skipped: 0, Time elapsed: 0.298 sec
Running org.syncope.core.persistence.relationships.RoleTest
Tests run: 1, Failures: 0, Errors: 0, Skipped: 0, Time elapsed: 0.083 sec
Running org.syncope.core.persistence.relationships.DerSchemaTest
Tests run: 1, Failures: 0, Errors: 0, Skipped: 0, Time elapsed: 0.042 sec
Running org.syncope.core.persistence.relationships.MembershipTest
Tests run: 2, Failures: 0, Errors: 0, Skipped: 0, Time elapsed: 0.125 sec
Running org.syncope.core.persistence.relationships.ResourceTest
Tests run: 3, Failures: 0, Errors: 0, Skipped: 0, Time elapsed: 0.223 sec
Running org.syncope.core.persistence.relationships.UserTest
Tests run: 1, Failures: 0, Errors: 0, Skipped: 0, Time elapsed: 0.073 sec
Running org.syncope.core.persistence.relationships.AttrTest
Tests run: 3, Failures: 0, Errors: 0, Skipped: 0, Time elapsed: 0.099 sec

Results :

Tests run: 19, Failures: 0, Errors: 0, Skipped: 0

[JENKINS] Recording test results
[INFO]
[INFO] --- maven-war-plugin:2.1.1:war (default-war) @ syncope-core ---
[INFO] Packaging webapp
[INFO] Assembling webapp [syncope-core] in [<http://jenkins.syncope-idm.org/job/Syncope%20trunk%20(GNU%20Linux)/ws/core/target/syncope]>
[INFO] Processing war project
[INFO] Copying webapp webResources [<http://jenkins.syncope-idm.org/job/Syncope%20trunk%20(GNU%20Linux)/ws/core/src/main/webapp]> to [<http://jenkins.syncope-idm.org/job/Syncope%20trunk%20(GNU%20Linux)/ws/core/target/syncope]>
[INFO] Copying webapp resources [<http://jenkins.syncope-idm.org/job/Syncope%20trunk%20(GNU%20Linux)/ws/core/src/main/webapp]>
[INFO] Webapp assembled in [295 msecs]
[INFO] Building war: <http://jenkins.syncope-idm.org/job/Syncope%20trunk%20(GNU%20Linux)/ws/core/target/syncope.war>
[INFO] WEB-INF/web.xml already added, skipping
[INFO] Packaging classes
[INFO] Building jar: <http://jenkins.syncope-idm.org/job/Syncope%20trunk%20(GNU%20Linux)/ws/core/target/syncope-classes.jar>
[INFO]
[INFO] --- maven-antrun-plugin:1.6:run (explodeSyncopeWAR) @ syncope-core ---
[INFO] Executing tasks

main:
    [unzip] Expanding: <http://jenkins.syncope-idm.org/job/Syncope%20trunk%20(GNU%20Linux)/ws/core/target/syncope.war> into <http://jenkins.syncope-idm.org/job/Syncope%20trunk%20(GNU%20Linux)/ws/core/target/syncope-core-test>
[INFO] Executed tasks
[INFO]
[INFO] --- maven-antrun-plugin:1.6:run (setupTomcat) @ syncope-core ---
[INFO] Executing tasks

main:
      [get] Destination already exists (skipping): /tmp/apache-tomcat-7.0.22.zip
    [unzip] Expanding: /tmp/apache-tomcat-7.0.22.zip into /tmp
[INFO] Executed tasks
[INFO]
[INFO] --- maven-antrun-plugin:1.6:run (setupCSV) @ syncope-core ---
[INFO] Executing tasks

main:
     [copy] Copying 1 file to /tmp
[INFO] Executed tasks
[INFO]
[INFO] --- maven-enforcer-plugin:1.0:enforce (enforce-maven) @ syncope-core ---
[INFO]
[INFO] --- syncope-build-tools:0.7-SNAPSHOT:set-dynamic-properties (set-dynamic-properties) @ syncope-core ---
[JENKINS] Archiving <http://jenkins.syncope-idm.org/job/Syncope%20trunk%20(GNU%20Linux)/ws/core/pom.xml> to /var/lib/jenkins/jobs/Syncope trunk (GNU Linux)/modules/org.syncope$syncope-core/builds/2011-10-13_17-58-16/archive/org.syncope/syncope-core/0.7-SNAPSHOT/syncope-core-0.7-SNAPSHOT.pom
[JENKINS] Archiving <http://jenkins.syncope-idm.org/job/Syncope%20trunk%20(GNU%20Linux)/ws/core/target/syncope.war> to /var/lib/jenkins/jobs/Syncope trunk (GNU Linux)/modules/org.syncope$syncope-core/builds/2011-10-13_17-58-16/archive/org.syncope/syncope-core/0.7-SNAPSHOT/syncope-core-0.7-SNAPSHOT.war
[JENKINS] Archiving <http://jenkins.syncope-idm.org/job/Syncope%20trunk%20(GNU%20Linux)/ws/core/target/syncope-classes.jar> to /var/lib/jenkins/jobs/Syncope trunk (GNU Linux)/modules/org.syncope$syncope-core/builds/2011-10-13_17-58-16/archive/org.syncope/syncope-core/0.7-SNAPSHOT/syncope-core-0.7-SNAPSHOT-classes.jar
ignoring exception during new ExecutedMojo null
[INFO]
[INFO] --- exec-maven-plugin:1.2.1:java (startTestDb) @ syncope-core ---
Web Console server running at http://192.168.0.1:8082 (only local connections)
TCP server running at tcp://192.168.0.1:9092 (only local connections)
[INFO]
[INFO] --- sql-maven-plugin:1.4:execute (loadTestDb) @ syncope-core ---
[INFO] Executing file: /tmp/testdb.385310053sql
[INFO] 4 of 4 SQL statements executed successfully
[INFO]
[INFO] --- cargo-maven2-plugin:1.1.2:start (start-container) @ syncope-core ---
[INFO]
[INFO] --- maven-failsafe-plugin:2.9:integration-test (default) @ syncope-core ---
[INFO] Failsafe report directory: <http://jenkins.syncope-idm.org/job/Syncope%20trunk%20(GNU%20Linux)/ws/core/target/failsafe-reports>

-------------------------------------------------------
 T E S T S
-------------------------------------------------------
Running org.syncope.core.rest.TaskTestITCase
Tests run: 10, Failures: 0, Errors: 0, Skipped: 0, Time elapsed: 17.468 sec
Running org.syncope.core.rest.AuthenticationTestITCase
Tests run: 4, Failures: 0, Errors: 0, Skipped: 0, Time elapsed: 1.064 sec
Running org.syncope.core.rest.UserTestITCase
Tests run: 22, Failures: 0, Errors: 0, Skipped: 0, Time elapsed: 5.792 sec
Running org.syncope.core.rest.PolicyTestITCase
Tests run: 9, Failures: 0, Errors: 1, Skipped: 0, Time elapsed: 0.586 sec <<< FAILURE!
Running org.syncope.core.rest.SchemaTestITCase
Tests run: 4, Failures: 0, Errors: 0, Skipped: 0, Time elapsed: 0.594 sec
Running org.syncope.core.rest.LogTestITCase
Tests run: 1, Failures: 0, Errors: 0, Skipped: 0, Time elapsed: 0.083 sec
Running org.syncope.core.rest.ConfigurationTestITCase
Tests run: 5, Failures: 0, Errors: 0, Skipped: 0, Time elapsed: 0.42 sec
Running org.syncope.core.rest.DerivedSchemaTestITCase
Tests run: 5, Failures: 0, Errors: 0, Skipped: 0, Time elapsed: 0.479 sec
Running org.syncope.core.rest.RoleTestITCase
Tests run: 10, Failures: 0, Errors: 0, Skipped: 0, Time elapsed: 0.838 sec
Running org.syncope.core.rest.ResourceTestITCase
Tests run: 13, Failures: 0, Errors: 0, Skipped: 0, Time elapsed: 0.9 sec
Running org.syncope.core.rest.ConnInstanceTestITCase
Tests run: 10, Failures: 0, Errors: 0, Skipped: 0, Time elapsed: 0.989 sec
Running org.syncope.core.rest.VirtualSchemaTestITCase
Tests run: 4, Failures: 0, Errors: 0, Skipped: 0, Time elapsed: 0.295 sec

Results :

Tests in error:
  update(org.syncope.core.rest.PolicyTestITCase): {[NotFound [Policy 2 not found]], }

Tests run: 97, Failures: 0, Errors: 1, Skipped: 0

[JENKINS] Recording test results
[INFO]
[INFO] --- cargo-maven2-plugin:1.1.2:stop (stop-container) @ syncope-core ---
[INFO]
[INFO] --- maven-failsafe-plugin:2.9:verify (default) @ syncope-core ---
[INFO] Failsafe report directory: <http://jenkins.syncope-idm.org/job/Syncope%20trunk%20(GNU%20Linux)/ws/core/target/failsafe-reports>
[INFO] ------------------------------------------------------------------------
[INFO] Reactor Summary:
[INFO]
[INFO] Syncope ........................................... SUCCESS [4.953s]
[INFO] Syncope build tools ............................... SUCCESS [10.006s]
[INFO] Syncope client .................................... SUCCESS [20.788s]
[INFO] Syncope core ...................................... FAILURE [1:29.001s]
[INFO] Syncope console ................................... SKIPPED
[INFO] Syncope archetype ................................. SKIPPED
[INFO] ------------------------------------------------------------------------
[INFO] BUILD FAILURE
[INFO] ------------------------------------------------------------------------
[INFO] Total time: 2:08.155s
[INFO] Finished at: Thu Oct 13 18:00:28 CEST 2011
[INFO] Final Memory: 58M/481M
[INFO] ------------------------------------------------------------------------
mavenExecutionResult exceptions not empty
message : Failed to execute goal org.apache.maven.plugins:maven-failsafe-plugin:2.9:verify (default) on project syncope-core: There are test failures.

Please refer to <http://jenkins.syncope-idm.org/job/Syncope%20trunk%20(GNU%20Linux)/ws/core/target/failsafe-reports> for the individual test results.
cause : There are test failures.

Please refer to <http://jenkins.syncope-idm.org/job/Syncope%20trunk%20(GNU%20Linux)/ws/core/target/failsafe-reports> for the individual test results.
Stack trace :
org.apache.maven.lifecycle.LifecycleExecutionException: Failed to execute goal org.apache.maven.plugins:maven-failsafe-plugin:2.9:verify (default) on project syncope-core: There are test failures.

Please refer to <http://jenkins.syncope-idm.org/job/Syncope%20trunk%20(GNU%20Linux)/ws/core/target/failsafe-reports> for the individual test results.
        at org.apache.maven.lifecycle.internal.MojoExecutor.execute(MojoExecutor.java:213)
        at org.apache.maven.lifecycle.internal.MojoExecutor.execute(MojoExecutor.java:153)
        at org.apache.maven.lifecycle.internal.MojoExecutor.execute(MojoExecutor.java:145)
        at org.apache.maven.lifecycle.internal.LifecycleModuleBuilder.buildProject(LifecycleModuleBuilder.java:84)
        at org.apache.maven.lifecycle.internal.LifecycleModuleBuilder.buildProject(LifecycleModuleBuilder.java:59)
        at org.apache.maven.lifecycle.internal.LifecycleStarter.singleThreadedBuild(LifecycleStarter.java:183)
        at org.apache.maven.lifecycle.internal.LifecycleStarter.execute(LifecycleStarter.java:161)
        at org.apache.maven.DefaultMaven.doExecute(DefaultMaven.java:319)
        at org.apache.maven.DefaultMaven.execute(DefaultMaven.java:156)
        at org.jvnet.hudson.maven3.launcher.Maven3Launcher.main(Maven3Launcher.java:79)
        at sun.reflect.NativeMethodAccessorImpl.invoke0(Native Method)
        at sun.reflect.NativeMethodAccessorImpl.invoke(NativeMethodAccessorImpl.java:39)
        at sun.reflect.DelegatingMethodAccessorImpl.invoke(DelegatingMethodAccessorImpl.java:25)
        at java.lang.reflect.Method.invoke(Method.java:597)
        at org.codehaus.plexus.classworlds.launcher.Launcher.launchStandard(Launcher.java:329)
        at org.codehaus.plexus.classworlds.launcher.Launcher.launch(Launcher.java:239)
        at org.jvnet.hudson.maven3.agent.Maven3Main.launch(Maven3Main.java:158)
        at hudson.maven.Maven3Builder.call(Maven3Builder.java:122)
        at hudson.maven.Maven3Builder.call(Maven3Builder.java:74)
        at hudson.remoting.UserRequest.perform(UserRequest.java:118)
        at hudson.remoting.UserRequest.perform(UserRequest.java:48)
        at hudson.remoting.Request$2.run(Request.java:287)
        at java.util.concurrent.Executors$RunnableAdapter.call(Executors.java:441)
        at java.util.concurrent.FutureTask$Sync.innerRun(FutureTask.java:303)
        at java.util.concurrent.FutureTask.run(FutureTask.java:138)
        at java.util.concurrent.ThreadPoolExecutor$Worker.runTask(ThreadPoolExecutor.java:886)
        at java.util.concurrent.ThreadPoolExecutor$Worker.run(ThreadPoolExecutor.java:908)
        at java.lang.Thread.run(Thread.java:662)
Caused by: org.apache.maven.plugin.MojoFailureException: There are test failures.

Please refer to <http://jenkins.syncope-idm.org/job/Syncope%20trunk%20(GNU%20Linux)/ws/core/target/failsafe-reports> for the individual test results.
        at org.apache.maven.plugin.surefire.SurefireHelper.reportExecution(SurefireHelper.java:126)
        at org.apache.maven.plugin.failsafe.VerifyMojo.execute(VerifyMojo.java:208)
        at org.apache.maven.plugin.DefaultBuildPluginManager.executeMojo(DefaultBuildPluginManager.java:101)
        at org.apache.maven.lifecycle.internal.MojoExecutor.execute(MojoExecutor.java:209)
        ... 27 more
Maven failed with error.
[CHECKSTYLE] Aggregating results of Syncope
[CHECKSTYLE] Using set difference to compute new warnings
[CHECKSTYLE] Not changing build status, since no threshold has been exceeded
[CHECKSTYLE] Aggregating results of Syncope build tools
[CHECKSTYLE] Using set difference to compute new warnings
[CHECKSTYLE] Not changing build status, since no threshold has been exceeded
[CHECKSTYLE] Aggregating results of Syncope client
[CHECKSTYLE] Using set difference to compute new warnings
[CHECKSTYLE] Not changing build status, since no threshold has been exceeded
[FINDBUGS] Aggregating results of Syncope
[FINDBUGS] Using set difference to compute new warnings
[FINDBUGS] Not changing build status, since no threshold has been exceeded
[FINDBUGS] Aggregating results of Syncope build tools
[FINDBUGS] Using set difference to compute new warnings
[FINDBUGS] Not changing build status, since no threshold has been exceeded
[FINDBUGS] Aggregating results of Syncope client
[FINDBUGS] Using set difference to compute new warnings
[FINDBUGS] Not changing build status, since no threshold has been exceeded
[PMD] Aggregating results of Syncope
[PMD] Using set difference to compute new warnings
[PMD] Not changing build status, since no threshold has been exceeded
[PMD] Aggregating results of Syncope build tools
[PMD] Using set difference to compute new warnings
[PMD] Not changing build status, since no threshold has been exceeded
[PMD] Aggregating results of Syncope client
[PMD] Using set difference to compute new warnings
[PMD] Not changing build status, since no threshold has been exceeded
Sending e-mails to: [hidden email]
channel stopped

Reply | Threaded
Open this post in threaded view
|

[syncope-dev] Build failed in Jenkins: Syncope trunk (GNU Linux) #62

jenkins
See <http://jenkins.syncope-idm.org/job/Syncope%20trunk%20(GNU%20Linux)/62/changes>

Changes:

[[hidden email]] Fixes issue 173

------------------------------------------
[...truncated 1044 lines...]
Running org.syncope.core.persistence.dao.VirSchemaTest
Tests run: 4, Failures: 0, Errors: 0, Skipped: 0, Time elapsed: 0.057 sec
Running org.syncope.core.persistence.dao.RoleTest
Tests run: 8, Failures: 0, Errors: 0, Skipped: 0, Time elapsed: 0.243 sec
Running org.syncope.core.persistence.dao.VirAttrTest
Tests run: 6, Failures: 0, Errors: 0, Skipped: 0, Time elapsed: 0.119 sec
Running org.syncope.core.persistence.dao.EntitlementTest
Tests run: 4, Failures: 0, Errors: 0, Skipped: 0, Time elapsed: 0.116 sec
Running org.syncope.core.persistence.dao.DerSchemaTest
Tests run: 4, Failures: 0, Errors: 0, Skipped: 0, Time elapsed: 0.052 sec
Running org.syncope.core.persistence.dao.MembershipTest
Tests run: 4, Failures: 0, Errors: 0, Skipped: 0, Time elapsed: 0.1 sec
Running org.syncope.core.persistence.dao.ResourceTest
Tests run: 6, Failures: 0, Errors: 0, Skipped: 0, Time elapsed: 0.157 sec
Running org.syncope.core.persistence.dao.UserSearchTest
Tests run: 7, Failures: 0, Errors: 0, Skipped: 0, Time elapsed: 0.693 sec
Running org.syncope.core.persistence.dao.UserTest
Tests run: 11, Failures: 0, Errors: 0, Skipped: 0, Time elapsed: 0.437 sec
Running org.syncope.core.persistence.dao.AttrTest
Tests run: 7, Failures: 0, Errors: 0, Skipped: 0, Time elapsed: 0.154 sec
Running org.syncope.core.rest.data.ResourceDataBinderTest
Tests run: 2, Failures: 0, Errors: 0, Skipped: 0, Time elapsed: 0.005 sec
Running org.syncope.core.init.ConnInstanceLoaderTest
Tests run: 2, Failures: 0, Errors: 0, Skipped: 0, Time elapsed: 0.227 sec

Results :

Tests run: 97, Failures: 0, Errors: 0, Skipped: 0

[JENKINS] Recording test results
[INFO]
[INFO] --- maven-surefire-plugin:2.9:test (relationship-test-execution) @ syncope-core ---
[INFO] Surefire report directory: <http://jenkins.syncope-idm.org/job/Syncope%20trunk%20(GNU%20Linux)/ws/core/target/surefire-reports>

-------------------------------------------------------
 T E S T S
-------------------------------------------------------
Running org.syncope.core.persistence.relationships.SchemaTest
Tests run: 2, Failures: 0, Errors: 0, Skipped: 0, Time elapsed: 7.232 sec
Running org.syncope.core.persistence.relationships.TaskTest
Tests run: 6, Failures: 0, Errors: 0, Skipped: 0, Time elapsed: 0.328 sec
Running org.syncope.core.persistence.relationships.RoleTest
Tests run: 1, Failures: 0, Errors: 0, Skipped: 0, Time elapsed: 0.104 sec
Running org.syncope.core.persistence.relationships.DerSchemaTest
Tests run: 1, Failures: 0, Errors: 0, Skipped: 0, Time elapsed: 0.042 sec
Running org.syncope.core.persistence.relationships.MembershipTest
Tests run: 2, Failures: 0, Errors: 0, Skipped: 0, Time elapsed: 0.122 sec
Running org.syncope.core.persistence.relationships.ResourceTest
Tests run: 3, Failures: 0, Errors: 0, Skipped: 0, Time elapsed: 0.225 sec
Running org.syncope.core.persistence.relationships.UserTest
Tests run: 1, Failures: 0, Errors: 0, Skipped: 0, Time elapsed: 0.074 sec
Running org.syncope.core.persistence.relationships.AttrTest
Tests run: 3, Failures: 0, Errors: 0, Skipped: 0, Time elapsed: 0.112 sec

Results :

Tests run: 19, Failures: 0, Errors: 0, Skipped: 0

[JENKINS] Recording test results
[INFO]
[INFO] --- maven-war-plugin:2.1.1:war (default-war) @ syncope-core ---
[INFO] Packaging webapp
[INFO] Assembling webapp [syncope-core] in [<http://jenkins.syncope-idm.org/job/Syncope%20trunk%20(GNU%20Linux)/ws/core/target/syncope]>
[INFO] Processing war project
[INFO] Copying webapp webResources [<http://jenkins.syncope-idm.org/job/Syncope%20trunk%20(GNU%20Linux)/ws/core/src/main/webapp]> to [<http://jenkins.syncope-idm.org/job/Syncope%20trunk%20(GNU%20Linux)/ws/core/target/syncope]>
[INFO] Copying webapp resources [<http://jenkins.syncope-idm.org/job/Syncope%20trunk%20(GNU%20Linux)/ws/core/src/main/webapp]>
[INFO] Webapp assembled in [290 msecs]
[INFO] Building war: <http://jenkins.syncope-idm.org/job/Syncope%20trunk%20(GNU%20Linux)/ws/core/target/syncope.war>
[INFO] WEB-INF/web.xml already added, skipping
[INFO] Packaging classes
[INFO] Building jar: <http://jenkins.syncope-idm.org/job/Syncope%20trunk%20(GNU%20Linux)/ws/core/target/syncope-classes.jar>
[INFO]
[INFO] --- maven-antrun-plugin:1.6:run (explodeSyncopeWAR) @ syncope-core ---
[INFO] Executing tasks

main:
    [unzip] Expanding: <http://jenkins.syncope-idm.org/job/Syncope%20trunk%20(GNU%20Linux)/ws/core/target/syncope.war> into <http://jenkins.syncope-idm.org/job/Syncope%20trunk%20(GNU%20Linux)/ws/core/target/syncope-core-test>
[INFO] Executed tasks
[INFO]
[INFO] --- maven-antrun-plugin:1.6:run (setupTomcat) @ syncope-core ---
[INFO] Executing tasks

main:
      [get] Destination already exists (skipping): /tmp/apache-tomcat-7.0.22.zip
    [unzip] Expanding: /tmp/apache-tomcat-7.0.22.zip into /tmp
[INFO] Executed tasks
[INFO]
[INFO] --- maven-antrun-plugin:1.6:run (setupCSV) @ syncope-core ---
[INFO] Executing tasks

main:
     [copy] Copying 1 file to /tmp
[INFO] Executed tasks
[INFO]
[INFO] --- maven-enforcer-plugin:1.0:enforce (enforce-maven) @ syncope-core ---
[INFO]
[INFO] --- syncope-build-tools:0.7-SNAPSHOT:set-dynamic-properties (set-dynamic-properties) @ syncope-core ---
[JENKINS] Archiving <http://jenkins.syncope-idm.org/job/Syncope%20trunk%20(GNU%20Linux)/ws/core/pom.xml> to /var/lib/jenkins/jobs/Syncope trunk (GNU Linux)/modules/org.syncope$syncope-core/builds/2011-10-13_18-01-44/archive/org.syncope/syncope-core/0.7-SNAPSHOT/syncope-core-0.7-SNAPSHOT.pom
[JENKINS] Archiving <http://jenkins.syncope-idm.org/job/Syncope%20trunk%20(GNU%20Linux)/ws/core/target/syncope.war> to /var/lib/jenkins/jobs/Syncope trunk (GNU Linux)/modules/org.syncope$syncope-core/builds/2011-10-13_18-01-44/archive/org.syncope/syncope-core/0.7-SNAPSHOT/syncope-core-0.7-SNAPSHOT.war
[JENKINS] Archiving <http://jenkins.syncope-idm.org/job/Syncope%20trunk%20(GNU%20Linux)/ws/core/target/syncope-classes.jar> to /var/lib/jenkins/jobs/Syncope trunk (GNU Linux)/modules/org.syncope$syncope-core/builds/2011-10-13_18-01-44/archive/org.syncope/syncope-core/0.7-SNAPSHOT/syncope-core-0.7-SNAPSHOT-classes.jar
ignoring exception during new ExecutedMojo null
[INFO]
[INFO] --- exec-maven-plugin:1.2.1:java (startTestDb) @ syncope-core ---
Web Console server running at http://192.168.0.1:8082 (only local connections)
TCP server running at tcp://192.168.0.1:9092 (only local connections)
[INFO]
[INFO] --- sql-maven-plugin:1.4:execute (loadTestDb) @ syncope-core ---
[INFO] Executing file: /tmp/testdb.273483552sql
[INFO] 4 of 4 SQL statements executed successfully
[INFO]
[INFO] --- cargo-maven2-plugin:1.1.2:start (start-container) @ syncope-core ---
[INFO]
[INFO] --- maven-failsafe-plugin:2.9:integration-test (default) @ syncope-core ---
[INFO] Failsafe report directory: <http://jenkins.syncope-idm.org/job/Syncope%20trunk%20(GNU%20Linux)/ws/core/target/failsafe-reports>

-------------------------------------------------------
 T E S T S
-------------------------------------------------------
Running org.syncope.core.rest.TaskTestITCase
Tests run: 10, Failures: 0, Errors: 0, Skipped: 0, Time elapsed: 17.884 sec
Running org.syncope.core.rest.AuthenticationTestITCase
Tests run: 4, Failures: 0, Errors: 0, Skipped: 0, Time elapsed: 1.376 sec
Running org.syncope.core.rest.UserTestITCase
Tests run: 22, Failures: 0, Errors: 0, Skipped: 0, Time elapsed: 5.502 sec
Running org.syncope.core.rest.PolicyTestITCase
Tests run: 9, Failures: 0, Errors: 1, Skipped: 0, Time elapsed: 0.691 sec <<< FAILURE!
Running org.syncope.core.rest.SchemaTestITCase
Tests run: 4, Failures: 0, Errors: 0, Skipped: 0, Time elapsed: 0.647 sec
Running org.syncope.core.rest.LogTestITCase
Tests run: 1, Failures: 0, Errors: 0, Skipped: 0, Time elapsed: 0.089 sec
Running org.syncope.core.rest.ConfigurationTestITCase
Tests run: 5, Failures: 0, Errors: 0, Skipped: 0, Time elapsed: 0.476 sec
Running org.syncope.core.rest.DerivedSchemaTestITCase
Tests run: 5, Failures: 0, Errors: 0, Skipped: 0, Time elapsed: 0.519 sec
Running org.syncope.core.rest.RoleTestITCase
Tests run: 10, Failures: 0, Errors: 0, Skipped: 0, Time elapsed: 0.926 sec
Running org.syncope.core.rest.ResourceTestITCase
Tests run: 13, Failures: 0, Errors: 0, Skipped: 0, Time elapsed: 0.982 sec
Running org.syncope.core.rest.ConnInstanceTestITCase
Tests run: 10, Failures: 0, Errors: 0, Skipped: 0, Time elapsed: 1.065 sec
Running org.syncope.core.rest.VirtualSchemaTestITCase
Tests run: 4, Failures: 0, Errors: 0, Skipped: 0, Time elapsed: 0.289 sec

Results :

Tests in error:
  update(org.syncope.core.rest.PolicyTestITCase): {[NotFound [Policy 2 not found]], }

Tests run: 97, Failures: 0, Errors: 1, Skipped: 0

[JENKINS] Recording test results
[INFO]
[INFO] --- cargo-maven2-plugin:1.1.2:stop (stop-container) @ syncope-core ---
[INFO]
[INFO] --- maven-failsafe-plugin:2.9:verify (default) @ syncope-core ---
[INFO] Failsafe report directory: <http://jenkins.syncope-idm.org/job/Syncope%20trunk%20(GNU%20Linux)/ws/core/target/failsafe-reports>
[INFO] ------------------------------------------------------------------------
[INFO] Reactor Summary:
[INFO]
[INFO] Syncope ........................................... SUCCESS [4.347s]
[INFO] Syncope build tools ............................... SUCCESS [9.997s]
[INFO] Syncope client .................................... SUCCESS [21.179s]
[INFO] Syncope core ...................................... FAILURE [1:29.057s]
[INFO] Syncope console ................................... SKIPPED
[INFO] Syncope archetype ................................. SKIPPED
[INFO] ------------------------------------------------------------------------
[INFO] BUILD FAILURE
[INFO] ------------------------------------------------------------------------
[INFO] Total time: 2:08.304s
[INFO] Finished at: Thu Oct 13 18:03:56 CEST 2011
[INFO] Final Memory: 58M/481M
[INFO] ------------------------------------------------------------------------
mavenExecutionResult exceptions not empty
message : Failed to execute goal org.apache.maven.plugins:maven-failsafe-plugin:2.9:verify (default) on project syncope-core: There are test failures.

Please refer to <http://jenkins.syncope-idm.org/job/Syncope%20trunk%20(GNU%20Linux)/ws/core/target/failsafe-reports> for the individual test results.
cause : There are test failures.

Please refer to <http://jenkins.syncope-idm.org/job/Syncope%20trunk%20(GNU%20Linux)/ws/core/target/failsafe-reports> for the individual test results.
Stack trace :
org.apache.maven.lifecycle.LifecycleExecutionException: Failed to execute goal org.apache.maven.plugins:maven-failsafe-plugin:2.9:verify (default) on project syncope-core: There are test failures.

Please refer to <http://jenkins.syncope-idm.org/job/Syncope%20trunk%20(GNU%20Linux)/ws/core/target/failsafe-reports> for the individual test results.
        at org.apache.maven.lifecycle.internal.MojoExecutor.execute(MojoExecutor.java:213)
        at org.apache.maven.lifecycle.internal.MojoExecutor.execute(MojoExecutor.java:153)
        at org.apache.maven.lifecycle.internal.MojoExecutor.execute(MojoExecutor.java:145)
        at org.apache.maven.lifecycle.internal.LifecycleModuleBuilder.buildProject(LifecycleModuleBuilder.java:84)
        at org.apache.maven.lifecycle.internal.LifecycleModuleBuilder.buildProject(LifecycleModuleBuilder.java:59)
        at org.apache.maven.lifecycle.internal.LifecycleStarter.singleThreadedBuild(LifecycleStarter.java:183)
        at org.apache.maven.lifecycle.internal.LifecycleStarter.execute(LifecycleStarter.java:161)
        at org.apache.maven.DefaultMaven.doExecute(DefaultMaven.java:319)
        at org.apache.maven.DefaultMaven.execute(DefaultMaven.java:156)
        at org.jvnet.hudson.maven3.launcher.Maven3Launcher.main(Maven3Launcher.java:79)
        at sun.reflect.NativeMethodAccessorImpl.invoke0(Native Method)
        at sun.reflect.NativeMethodAccessorImpl.invoke(NativeMethodAccessorImpl.java:39)
        at sun.reflect.DelegatingMethodAccessorImpl.invoke(DelegatingMethodAccessorImpl.java:25)
        at java.lang.reflect.Method.invoke(Method.java:597)
        at org.codehaus.plexus.classworlds.launcher.Launcher.launchStandard(Launcher.java:329)
        at org.codehaus.plexus.classworlds.launcher.Launcher.launch(Launcher.java:239)
        at org.jvnet.hudson.maven3.agent.Maven3Main.launch(Maven3Main.java:158)
        at hudson.maven.Maven3Builder.call(Maven3Builder.java:122)
        at hudson.maven.Maven3Builder.call(Maven3Builder.java:74)
        at hudson.remoting.UserRequest.perform(UserRequest.java:118)
        at hudson.remoting.UserRequest.perform(UserRequest.java:48)
        at hudson.remoting.Request$2.run(Request.java:287)
        at java.util.concurrent.Executors$RunnableAdapter.call(Executors.java:441)
        at java.util.concurrent.FutureTask$Sync.innerRun(FutureTask.java:303)
        at java.util.concurrent.FutureTask.run(FutureTask.java:138)
        at java.util.concurrent.ThreadPoolExecutor$Worker.runTask(ThreadPoolExecutor.java:886)
        at java.util.concurrent.ThreadPoolExecutor$Worker.run(ThreadPoolExecutor.java:908)
        at java.lang.Thread.run(Thread.java:662)
Caused by: org.apache.maven.plugin.MojoFailureException: There are test failures.

Please refer to <http://jenkins.syncope-idm.org/job/Syncope%20trunk%20(GNU%20Linux)/ws/core/target/failsafe-reports> for the individual test results.
        at org.apache.maven.plugin.surefire.SurefireHelper.reportExecution(SurefireHelper.java:126)
        at org.apache.maven.plugin.failsafe.VerifyMojo.execute(VerifyMojo.java:208)
        at org.apache.maven.plugin.DefaultBuildPluginManager.executeMojo(DefaultBuildPluginManager.java:101)
        at org.apache.maven.lifecycle.internal.MojoExecutor.execute(MojoExecutor.java:209)
        ... 27 more
Maven failed with error.
[CHECKSTYLE] Aggregating results of Syncope
[CHECKSTYLE] Using set difference to compute new warnings
[CHECKSTYLE] Not changing build status, since no threshold has been exceeded
[CHECKSTYLE] Aggregating results of Syncope build tools
[CHECKSTYLE] Using set difference to compute new warnings
[CHECKSTYLE] Not changing build status, since no threshold has been exceeded
[CHECKSTYLE] Aggregating results of Syncope client
[CHECKSTYLE] Using set difference to compute new warnings
[CHECKSTYLE] Not changing build status, since no threshold has been exceeded
[FINDBUGS] Aggregating results of Syncope
[FINDBUGS] Using set difference to compute new warnings
[FINDBUGS] Not changing build status, since no threshold has been exceeded
[FINDBUGS] Aggregating results of Syncope build tools
[FINDBUGS] Using set difference to compute new warnings
[FINDBUGS] Not changing build status, since no threshold has been exceeded
[FINDBUGS] Aggregating results of Syncope client
[FINDBUGS] Using set difference to compute new warnings
[FINDBUGS] Not changing build status, since no threshold has been exceeded
[PMD] Aggregating results of Syncope
[PMD] Using set difference to compute new warnings
[PMD] Not changing build status, since no threshold has been exceeded
[PMD] Aggregating results of Syncope build tools
[PMD] Using set difference to compute new warnings
[PMD] Not changing build status, since no threshold has been exceeded
[PMD] Aggregating results of Syncope client
[PMD] Using set difference to compute new warnings
[PMD] Not changing build status, since no threshold has been exceeded
Sending e-mails to: [hidden email] [hidden email]
channel stopped

Reply | Threaded
Open this post in threaded view
|

[syncope-dev] Jenkins build is back to normal : Syncope trunk (GNU Linux) #63

jenkins