[syncope-dev] Build failed in Jenkins: Syncope trunk (GNU Linux) #52

classic Classic list List threaded Threaded
2 messages Options
Reply | Threaded
Open this post in threaded view
|

[syncope-dev] Build failed in Jenkins: Syncope trunk (GNU Linux) #52

jenkins
See <http://jenkins.syncope-idm.org/job/Syncope%20trunk%20(GNU%20Linux)/52/changes>

Changes:

[chicchiricco] (Fix issue 158 170)

------------------------------------------
[...truncated 1044 lines...]
Tests run: 4, Failures: 0, Errors: 0, Skipped: 0, Time elapsed: 0.508 sec
Running org.syncope.core.persistence.dao.RoleTest
Tests run: 8, Failures: 0, Errors: 0, Skipped: 0, Time elapsed: 1.226 sec
Running org.syncope.core.persistence.dao.VirAttrTest
Tests run: 6, Failures: 0, Errors: 0, Skipped: 0, Time elapsed: 0.287 sec
Running org.syncope.core.persistence.dao.EntitlementTest
Tests run: 4, Failures: 0, Errors: 0, Skipped: 0, Time elapsed: 0.268 sec
Running org.syncope.core.persistence.dao.DerSchemaTest
Tests run: 4, Failures: 0, Errors: 0, Skipped: 0, Time elapsed: 0.042 sec
Running org.syncope.core.persistence.dao.MembershipTest
Tests run: 4, Failures: 0, Errors: 0, Skipped: 0, Time elapsed: 0.071 sec
Running org.syncope.core.persistence.dao.ResourceTest
Tests run: 6, Failures: 0, Errors: 0, Skipped: 0, Time elapsed: 0.119 sec
Running org.syncope.core.persistence.dao.UserSearchTest
Tests run: 7, Failures: 0, Errors: 0, Skipped: 0, Time elapsed: 0.61 sec
Running org.syncope.core.persistence.dao.UserTest
Tests run: 11, Failures: 0, Errors: 0, Skipped: 0, Time elapsed: 0.282 sec
Running org.syncope.core.persistence.dao.AttrTest
Tests run: 7, Failures: 0, Errors: 0, Skipped: 0, Time elapsed: 0.102 sec
Running org.syncope.core.rest.data.ResourceDataBinderTest
Tests run: 2, Failures: 0, Errors: 0, Skipped: 0, Time elapsed: 0.005 sec
Running org.syncope.core.init.ConnInstanceLoaderTest
Tests run: 2, Failures: 0, Errors: 0, Skipped: 0, Time elapsed: 0.212 sec

Results :

Tests run: 97, Failures: 0, Errors: 0, Skipped: 0

[JENKINS] Recording test results
[INFO]
[INFO] --- maven-surefire-plugin:2.9:test (relationship-test-execution) @ syncope-core ---
[INFO] Surefire report directory: <http://jenkins.syncope-idm.org/job/Syncope%20trunk%20(GNU%20Linux)/ws/core/target/surefire-reports>

-------------------------------------------------------
 T E S T S
-------------------------------------------------------
Running org.syncope.core.persistence.relationships.SchemaTest
Tests run: 2, Failures: 0, Errors: 0, Skipped: 0, Time elapsed: 7.692 sec
Running org.syncope.core.persistence.relationships.TaskTest
Tests run: 6, Failures: 0, Errors: 0, Skipped: 0, Time elapsed: 0.371 sec
Running org.syncope.core.persistence.relationships.RoleTest
Tests run: 1, Failures: 0, Errors: 0, Skipped: 0, Time elapsed: 0.112 sec
Running org.syncope.core.persistence.relationships.DerSchemaTest
Tests run: 1, Failures: 0, Errors: 0, Skipped: 0, Time elapsed: 0.052 sec
Running org.syncope.core.persistence.relationships.MembershipTest
Tests run: 2, Failures: 0, Errors: 0, Skipped: 0, Time elapsed: 0.166 sec
Running org.syncope.core.persistence.relationships.ResourceTest
Tests run: 3, Failures: 0, Errors: 0, Skipped: 0, Time elapsed: 0.244 sec
Running org.syncope.core.persistence.relationships.UserTest
Tests run: 1, Failures: 0, Errors: 0, Skipped: 0, Time elapsed: 0.079 sec
Running org.syncope.core.persistence.relationships.AttrTest
Tests run: 3, Failures: 0, Errors: 0, Skipped: 0, Time elapsed: 0.119 sec

Results :

Tests run: 19, Failures: 0, Errors: 0, Skipped: 0

[JENKINS] Recording test results
[INFO]
[INFO] --- maven-war-plugin:2.1.1:war (default-war) @ syncope-core ---
[INFO] Packaging webapp
[INFO] Assembling webapp [syncope-core] in [<http://jenkins.syncope-idm.org/job/Syncope%20trunk%20(GNU%20Linux)/ws/core/target/syncope]>
[INFO] Processing war project
[INFO] Copying webapp webResources [<http://jenkins.syncope-idm.org/job/Syncope%20trunk%20(GNU%20Linux)/ws/core/src/main/webapp]> to [<http://jenkins.syncope-idm.org/job/Syncope%20trunk%20(GNU%20Linux)/ws/core/target/syncope]>
[INFO] Copying webapp resources [<http://jenkins.syncope-idm.org/job/Syncope%20trunk%20(GNU%20Linux)/ws/core/src/main/webapp]>
[INFO] Webapp assembled in [455 msecs]
[INFO] Building war: <http://jenkins.syncope-idm.org/job/Syncope%20trunk%20(GNU%20Linux)/ws/core/target/syncope.war>
[INFO] WEB-INF/web.xml already added, skipping
[INFO] Packaging classes
[INFO] Building jar: <http://jenkins.syncope-idm.org/job/Syncope%20trunk%20(GNU%20Linux)/ws/core/target/syncope-classes.jar>
[INFO]
[INFO] --- maven-antrun-plugin:1.6:run (explodeSyncopeWAR) @ syncope-core ---
[INFO] Executing tasks

main:
    [unzip] Expanding: <http://jenkins.syncope-idm.org/job/Syncope%20trunk%20(GNU%20Linux)/ws/core/target/syncope.war> into <http://jenkins.syncope-idm.org/job/Syncope%20trunk%20(GNU%20Linux)/ws/core/target/syncope-core-test>
[INFO] Executed tasks
[INFO]
[INFO] --- maven-antrun-plugin:1.6:run (setupTomcat) @ syncope-core ---
[INFO] Executing tasks

main:
      [get] Destination already exists (skipping): /tmp/apache-tomcat-7.0.22.zip
    [unzip] Expanding: /tmp/apache-tomcat-7.0.22.zip into /tmp
[INFO] Executed tasks
[INFO]
[INFO] --- maven-antrun-plugin:1.6:run (setupCSV) @ syncope-core ---
[INFO] Executing tasks

main:
     [copy] Copying 1 file to /tmp
[INFO] Executed tasks
[INFO]
[INFO] --- maven-enforcer-plugin:1.0:enforce (enforce-maven) @ syncope-core ---
[INFO]
[INFO] --- syncope-build-tools:0.7-SNAPSHOT:set-dynamic-properties (set-dynamic-properties) @ syncope-core ---
[JENKINS] Archiving <http://jenkins.syncope-idm.org/job/Syncope%20trunk%20(GNU%20Linux)/ws/core/pom.xml> to /var/lib/jenkins/jobs/Syncope trunk (GNU Linux)/modules/org.syncope$syncope-core/builds/2011-10-05_17-21-22/archive/org.syncope/syncope-core/0.7-SNAPSHOT/syncope-core-0.7-SNAPSHOT.pom
[JENKINS] Archiving <http://jenkins.syncope-idm.org/job/Syncope%20trunk%20(GNU%20Linux)/ws/core/target/syncope.war> to /var/lib/jenkins/jobs/Syncope trunk (GNU Linux)/modules/org.syncope$syncope-core/builds/2011-10-05_17-21-22/archive/org.syncope/syncope-core/0.7-SNAPSHOT/syncope-core-0.7-SNAPSHOT.war
[JENKINS] Archiving <http://jenkins.syncope-idm.org/job/Syncope%20trunk%20(GNU%20Linux)/ws/core/target/syncope-classes.jar> to /var/lib/jenkins/jobs/Syncope trunk (GNU Linux)/modules/org.syncope$syncope-core/builds/2011-10-05_17-21-22/archive/org.syncope/syncope-core/0.7-SNAPSHOT/syncope-core-0.7-SNAPSHOT-classes.jar
ignoring exception during new ExecutedMojo null
[INFO]
[INFO] --- exec-maven-plugin:1.2.1:java (startTestDb) @ syncope-core ---
Web Console server running at http://192.168.0.1:8082 (only local connections)
TCP server running at tcp://192.168.0.1:9092 (only local connections)
[INFO]
[INFO] --- sql-maven-plugin:1.4:execute (loadTestDb) @ syncope-core ---
[INFO] Executing file: /tmp/testdb.125111062sql
[INFO] 4 of 4 SQL statements executed successfully
[INFO]
[INFO] --- cargo-maven2-plugin:1.1.2:start (start-container) @ syncope-core ---
[INFO]
[INFO] --- maven-failsafe-plugin:2.9:integration-test (default) @ syncope-core ---
[INFO] Failsafe report directory: <http://jenkins.syncope-idm.org/job/Syncope%20trunk%20(GNU%20Linux)/ws/core/target/failsafe-reports>

-------------------------------------------------------
 T E S T S
-------------------------------------------------------
Running org.syncope.core.rest.TaskTestITCase
Tests run: 10, Failures: 1, Errors: 0, Skipped: 0, Time elapsed: 79.945 sec <<< FAILURE!
Running org.syncope.core.rest.AuthenticationTestITCase
Tests run: 4, Failures: 0, Errors: 0, Skipped: 0, Time elapsed: 1.611 sec
Running org.syncope.core.rest.UserTestITCase
Tests run: 21, Failures: 0, Errors: 0, Skipped: 0, Time elapsed: 6.727 sec
Running org.syncope.core.rest.PolicyTestITCase
Tests run: 9, Failures: 0, Errors: 0, Skipped: 0, Time elapsed: 1.205 sec
Running org.syncope.core.rest.SchemaTestITCase
Tests run: 4, Failures: 0, Errors: 0, Skipped: 0, Time elapsed: 35.117 sec
Running org.syncope.core.rest.LogTestITCase
Tests run: 1, Failures: 0, Errors: 0, Skipped: 0, Time elapsed: 4.783 sec
Running org.syncope.core.rest.ConfigurationTestITCase
Tests run: 5, Failures: 0, Errors: 0, Skipped: 0, Time elapsed: 0.501 sec
Running org.syncope.core.rest.DerivedSchemaTestITCase
Tests run: 5, Failures: 0, Errors: 0, Skipped: 0, Time elapsed: 0.8 sec
Running org.syncope.core.rest.RoleTestITCase
Tests run: 10, Failures: 0, Errors: 0, Skipped: 0, Time elapsed: 1.099 sec
Running org.syncope.core.rest.ResourceTestITCase
Tests run: 13, Failures: 0, Errors: 0, Skipped: 0, Time elapsed: 1.534 sec
Running org.syncope.core.rest.ConnInstanceTestITCase
Tests run: 10, Failures: 0, Errors: 0, Skipped: 0, Time elapsed: 1.289 sec
Running org.syncope.core.rest.VirtualSchemaTestITCase
Tests run: 4, Failures: 0, Errors: 0, Skipped: 0, Time elapsed: 0.359 sec

Results :

Failed tests:   sync(org.syncope.core.rest.TaskTestITCase): Expected 14, found 4

Tests run: 96, Failures: 1, Errors: 0, Skipped: 0

[JENKINS] Recording test results
[INFO]
[INFO] --- cargo-maven2-plugin:1.1.2:stop (stop-container) @ syncope-core ---
[INFO]
[INFO] --- maven-failsafe-plugin:2.9:verify (default) @ syncope-core ---
[INFO] Failsafe report directory: <http://jenkins.syncope-idm.org/job/Syncope%20trunk%20(GNU%20Linux)/ws/core/target/failsafe-reports>
[INFO] ------------------------------------------------------------------------
[INFO] Reactor Summary:
[INFO]
[INFO] Syncope ........................................... SUCCESS [8.413s]
[INFO] Syncope build tools ............................... SUCCESS [17.566s]
[INFO] Syncope client .................................... SUCCESS [23.980s]
[INFO] Syncope core ...................................... FAILURE [3:48.550s]
[INFO] Syncope console ................................... SKIPPED
[INFO] Syncope archetype ................................. SKIPPED
[INFO] ------------------------------------------------------------------------
[INFO] BUILD FAILURE
[INFO] ------------------------------------------------------------------------
[INFO] Total time: 4:44.868s
[INFO] Finished at: Wed Oct 05 17:26:11 CEST 2011
[INFO] Final Memory: 59M/483M
[INFO] ------------------------------------------------------------------------
Waiting for Jenkins to finish collecting data
mavenExecutionResult exceptions not empty
message : Failed to execute goal org.apache.maven.plugins:maven-failsafe-plugin:2.9:verify (default) on project syncope-core: There are test failures.

Please refer to <http://jenkins.syncope-idm.org/job/Syncope%20trunk%20(GNU%20Linux)/ws/core/target/failsafe-reports> for the individual test results.
cause : There are test failures.

Please refer to <http://jenkins.syncope-idm.org/job/Syncope%20trunk%20(GNU%20Linux)/ws/core/target/failsafe-reports> for the individual test results.
Stack trace :
org.apache.maven.lifecycle.LifecycleExecutionException: Failed to execute goal org.apache.maven.plugins:maven-failsafe-plugin:2.9:verify (default) on project syncope-core: There are test failures.

Please refer to <http://jenkins.syncope-idm.org/job/Syncope%20trunk%20(GNU%20Linux)/ws/core/target/failsafe-reports> for the individual test results.
        at org.apache.maven.lifecycle.internal.MojoExecutor.execute(MojoExecutor.java:213)
        at org.apache.maven.lifecycle.internal.MojoExecutor.execute(MojoExecutor.java:153)
        at org.apache.maven.lifecycle.internal.MojoExecutor.execute(MojoExecutor.java:145)
        at org.apache.maven.lifecycle.internal.LifecycleModuleBuilder.buildProject(LifecycleModuleBuilder.java:84)
        at org.apache.maven.lifecycle.internal.LifecycleModuleBuilder.buildProject(LifecycleModuleBuilder.java:59)
        at org.apache.maven.lifecycle.internal.LifecycleStarter.singleThreadedBuild(LifecycleStarter.java:183)
        at org.apache.maven.lifecycle.internal.LifecycleStarter.execute(LifecycleStarter.java:161)
        at org.apache.maven.DefaultMaven.doExecute(DefaultMaven.java:319)
        at org.apache.maven.DefaultMaven.execute(DefaultMaven.java:156)
        at org.jvnet.hudson.maven3.launcher.Maven3Launcher.main(Maven3Launcher.java:79)
        at sun.reflect.NativeMethodAccessorImpl.invoke0(Native Method)
        at sun.reflect.NativeMethodAccessorImpl.invoke(NativeMethodAccessorImpl.java:39)
        at sun.reflect.DelegatingMethodAccessorImpl.invoke(DelegatingMethodAccessorImpl.java:25)
        at java.lang.reflect.Method.invoke(Method.java:597)
        at org.codehaus.plexus.classworlds.launcher.Launcher.launchStandard(Launcher.java:329)
        at org.codehaus.plexus.classworlds.launcher.Launcher.launch(Launcher.java:239)
        at org.jvnet.hudson.maven3.agent.Maven3Main.launch(Maven3Main.java:158)
        at hudson.maven.Maven3Builder.call(Maven3Builder.java:122)
        at hudson.maven.Maven3Builder.call(Maven3Builder.java:74)
        at hudson.remoting.UserRequest.perform(UserRequest.java:118)
        at hudson.remoting.UserRequest.perform(UserRequest.java:48)
        at hudson.remoting.Request$2.run(Request.java:287)
        at java.util.concurrent.Executors$RunnableAdapter.call(Executors.java:441)
        at java.util.concurrent.FutureTask$Sync.innerRun(FutureTask.java:303)
        at java.util.concurrent.FutureTask.run(FutureTask.java:138)
        at java.util.concurrent.ThreadPoolExecutor$Worker.runTask(ThreadPoolExecutor.java:886)
        at java.util.concurrent.ThreadPoolExecutor$Worker.run(ThreadPoolExecutor.java:908)
        at java.lang.Thread.run(Thread.java:662)
Caused by: org.apache.maven.plugin.MojoFailureException: There are test failures.

Please refer to <http://jenkins.syncope-idm.org/job/Syncope%20trunk%20(GNU%20Linux)/ws/core/target/failsafe-reports> for the individual test results.
        at org.apache.maven.plugin.surefire.SurefireHelper.reportExecution(SurefireHelper.java:126)
        at org.apache.maven.plugin.failsafe.VerifyMojo.execute(VerifyMojo.java:208)
        at org.apache.maven.plugin.DefaultBuildPluginManager.executeMojo(DefaultBuildPluginManager.java:101)
        at org.apache.maven.lifecycle.internal.MojoExecutor.execute(MojoExecutor.java:209)
        ... 27 more
Maven failed with error.
[CHECKSTYLE] Aggregating results of Syncope
[CHECKSTYLE] Using set difference to compute new warnings
[CHECKSTYLE] Not changing build status, since no threshold has been exceeded
[CHECKSTYLE] Aggregating results of Syncope build tools
[CHECKSTYLE] Using set difference to compute new warnings
[CHECKSTYLE] Not changing build status, since no threshold has been exceeded
[CHECKSTYLE] Aggregating results of Syncope client
[CHECKSTYLE] Using set difference to compute new warnings
[CHECKSTYLE] Not changing build status, since no threshold has been exceeded
[FINDBUGS] Aggregating results of Syncope
[FINDBUGS] Using set difference to compute new warnings
[FINDBUGS] Not changing build status, since no threshold has been exceeded
[FINDBUGS] Aggregating results of Syncope build tools
[FINDBUGS] Using set difference to compute new warnings
[FINDBUGS] Not changing build status, since no threshold has been exceeded
[FINDBUGS] Aggregating results of Syncope client
[FINDBUGS] Using set difference to compute new warnings
[FINDBUGS] Not changing build status, since no threshold has been exceeded
[PMD] Aggregating results of Syncope
[PMD] Using set difference to compute new warnings
[PMD] Not changing build status, since no threshold has been exceeded
[PMD] Aggregating results of Syncope build tools
[PMD] Using set difference to compute new warnings
[PMD] Not changing build status, since no threshold has been exceeded
[PMD] Aggregating results of Syncope client
[PMD] Using set difference to compute new warnings
[PMD] Not changing build status, since no threshold has been exceeded
Sending e-mails to: [hidden email]
channel stopped
Failed to send e-mail to chicchiricco because no e-mail address is known, and no default e-mail domain is configured

Reply | Threaded
Open this post in threaded view
|

[syncope-dev] Jenkins build is back to normal : Syncope trunk (GNU Linux) #53

jenkins