[syncope-dev] Build failed in Jenkins: Syncope trunk (GNU Linux) #49

classic Classic list List threaded Threaded
2 messages Options
Reply | Threaded
Open this post in threaded view
|

[syncope-dev] Build failed in Jenkins: Syncope trunk (GNU Linux) #49

jenkins
See <http://jenkins.syncope-idm.org/job/Syncope%20trunk%20(GNU%20Linux)/49/changes>

Changes:

[chicchiricco] Adjusting dev profiles to enable H2 web console by default

------------------------------------------
[...truncated 1035 lines...]
Tests run: 4, Failures: 0, Errors: 0, Skipped: 0, Time elapsed: 0.067 sec
Running org.syncope.core.persistence.dao.PolicyTest
Tests run: 9, Failures: 0, Errors: 0, Skipped: 0, Time elapsed: 0.11 sec
Running org.syncope.core.persistence.dao.TaskTest
Tests run: 4, Failures: 0, Errors: 0, Skipped: 0, Time elapsed: 0.2 sec
Running org.syncope.core.persistence.dao.TaskExecTest
Tests run: 2, Failures: 0, Errors: 0, Skipped: 0, Time elapsed: 0.064 sec
Running org.syncope.core.persistence.dao.DerAttrTest
Tests run: 6, Failures: 0, Errors: 0, Skipped: 0, Time elapsed: 0.15 sec
Running org.syncope.core.persistence.dao.VirSchemaTest
Tests run: 4, Failures: 0, Errors: 0, Skipped: 0, Time elapsed: 0.056 sec
Running org.syncope.core.persistence.dao.RoleTest
Tests run: 8, Failures: 0, Errors: 0, Skipped: 0, Time elapsed: 0.252 sec
Running org.syncope.core.persistence.dao.VirAttrTest
Tests run: 6, Failures: 0, Errors: 0, Skipped: 0, Time elapsed: 0.126 sec
Running org.syncope.core.persistence.dao.EntitlementTest
Tests run: 4, Failures: 0, Errors: 0, Skipped: 0, Time elapsed: 0.109 sec
Running org.syncope.core.persistence.dao.DerSchemaTest
Tests run: 4, Failures: 0, Errors: 0, Skipped: 0, Time elapsed: 0.051 sec
Running org.syncope.core.persistence.dao.MembershipTest
Tests run: 4, Failures: 0, Errors: 0, Skipped: 0, Time elapsed: 0.095 sec
Running org.syncope.core.persistence.dao.ResourceTest
Tests run: 6, Failures: 0, Errors: 0, Skipped: 0, Time elapsed: 0.153 sec
Running org.syncope.core.persistence.dao.UserSearchTest
Tests run: 7, Failures: 0, Errors: 0, Skipped: 0, Time elapsed: 0.584 sec
Running org.syncope.core.persistence.dao.UserTest
Tests run: 11, Failures: 0, Errors: 0, Skipped: 0, Time elapsed: 0.356 sec
Running org.syncope.core.persistence.dao.AttrTest
Tests run: 7, Failures: 0, Errors: 0, Skipped: 0, Time elapsed: 0.252 sec
Running org.syncope.core.rest.data.ResourceDataBinderTest
Tests run: 2, Failures: 0, Errors: 0, Skipped: 0, Time elapsed: 0.003 sec
Running org.syncope.core.init.ConnInstanceLoaderTest
Tests run: 2, Failures: 0, Errors: 0, Skipped: 0, Time elapsed: 0.226 sec

Results :

Tests run: 97, Failures: 0, Errors: 0, Skipped: 0

[JENKINS] Recording test results
[INFO]
[INFO] --- maven-surefire-plugin:2.9:test (relationship-test-execution) @ syncope-core ---
[INFO] Surefire report directory: <http://jenkins.syncope-idm.org/job/Syncope%20trunk%20(GNU%20Linux)/ws/core/target/surefire-reports>

-------------------------------------------------------
 T E S T S
-------------------------------------------------------
Running org.syncope.core.persistence.relationships.SchemaTest
Tests run: 2, Failures: 0, Errors: 0, Skipped: 0, Time elapsed: 7.3 sec
Running org.syncope.core.persistence.relationships.TaskTest
Tests run: 6, Failures: 0, Errors: 0, Skipped: 0, Time elapsed: 0.311 sec
Running org.syncope.core.persistence.relationships.RoleTest
Tests run: 1, Failures: 0, Errors: 0, Skipped: 0, Time elapsed: 0.087 sec
Running org.syncope.core.persistence.relationships.DerSchemaTest
Tests run: 1, Failures: 0, Errors: 0, Skipped: 0, Time elapsed: 0.068 sec
Running org.syncope.core.persistence.relationships.MembershipTest
Tests run: 2, Failures: 0, Errors: 0, Skipped: 0, Time elapsed: 0.127 sec
Running org.syncope.core.persistence.relationships.ResourceTest
Tests run: 3, Failures: 0, Errors: 0, Skipped: 0, Time elapsed: 0.221 sec
Running org.syncope.core.persistence.relationships.UserTest
Tests run: 1, Failures: 0, Errors: 0, Skipped: 0, Time elapsed: 0.071 sec
Running org.syncope.core.persistence.relationships.AttrTest
Tests run: 3, Failures: 0, Errors: 0, Skipped: 0, Time elapsed: 0.094 sec

Results :

Tests run: 19, Failures: 0, Errors: 0, Skipped: 0

[JENKINS] Recording test results
[INFO]
[INFO] --- maven-war-plugin:2.1.1:war (default-war) @ syncope-core ---
[INFO] Packaging webapp
[INFO] Assembling webapp [syncope-core] in [<http://jenkins.syncope-idm.org/job/Syncope%20trunk%20(GNU%20Linux)/ws/core/target/syncope]>
[INFO] Processing war project
[INFO] Copying webapp webResources [<http://jenkins.syncope-idm.org/job/Syncope%20trunk%20(GNU%20Linux)/ws/core/src/main/webapp]> to [<http://jenkins.syncope-idm.org/job/Syncope%20trunk%20(GNU%20Linux)/ws/core/target/syncope]>
[INFO] Copying webapp resources [<http://jenkins.syncope-idm.org/job/Syncope%20trunk%20(GNU%20Linux)/ws/core/src/main/webapp]>
[INFO] Webapp assembled in [268 msecs]
[INFO] Building war: <http://jenkins.syncope-idm.org/job/Syncope%20trunk%20(GNU%20Linux)/ws/core/target/syncope.war>
[INFO] WEB-INF/web.xml already added, skipping
[INFO] Packaging classes
[INFO] Building jar: <http://jenkins.syncope-idm.org/job/Syncope%20trunk%20(GNU%20Linux)/ws/core/target/syncope-classes.jar>
[INFO]
[INFO] --- maven-antrun-plugin:1.6:run (explodeSyncopeWAR) @ syncope-core ---
[INFO] Executing tasks

main:
    [unzip] Expanding: <http://jenkins.syncope-idm.org/job/Syncope%20trunk%20(GNU%20Linux)/ws/core/target/syncope.war> into <http://jenkins.syncope-idm.org/job/Syncope%20trunk%20(GNU%20Linux)/ws/core/target/syncope-core-test>
[INFO] Executed tasks
[INFO]
[INFO] --- maven-antrun-plugin:1.6:run (setupTomcat) @ syncope-core ---
[INFO] Executing tasks

main:
      [get] Destination already exists (skipping): /tmp/apache-tomcat-7.0.22.zip
    [unzip] Expanding: /tmp/apache-tomcat-7.0.22.zip into /tmp
[INFO] Executed tasks
[INFO]
[INFO] --- maven-antrun-plugin:1.6:run (setupCSV) @ syncope-core ---
[INFO] Executing tasks

main:
     [copy] Copying 1 file to /tmp
[INFO] Executed tasks
[INFO]
[INFO] --- maven-enforcer-plugin:1.0:enforce (enforce-maven) @ syncope-core ---
[INFO]
[INFO] --- syncope-build-tools:0.7-SNAPSHOT:set-dynamic-properties (set-dynamic-properties) @ syncope-core ---
[JENKINS] Archiving <http://jenkins.syncope-idm.org/job/Syncope%20trunk%20(GNU%20Linux)/ws/core/pom.xml> to /var/lib/jenkins/jobs/Syncope trunk (GNU Linux)/modules/org.syncope$syncope-core/builds/2011-10-05_12-51-40/archive/org.syncope/syncope-core/0.7-SNAPSHOT/syncope-core-0.7-SNAPSHOT.pom
[JENKINS] Archiving <http://jenkins.syncope-idm.org/job/Syncope%20trunk%20(GNU%20Linux)/ws/core/target/syncope.war> to /var/lib/jenkins/jobs/Syncope trunk (GNU Linux)/modules/org.syncope$syncope-core/builds/2011-10-05_12-51-40/archive/org.syncope/syncope-core/0.7-SNAPSHOT/syncope-core-0.7-SNAPSHOT.war
[JENKINS] Archiving <http://jenkins.syncope-idm.org/job/Syncope%20trunk%20(GNU%20Linux)/ws/core/target/syncope-classes.jar> to /var/lib/jenkins/jobs/Syncope trunk (GNU Linux)/modules/org.syncope$syncope-core/builds/2011-10-05_12-51-40/archive/org.syncope/syncope-core/0.7-SNAPSHOT/syncope-core-0.7-SNAPSHOT-classes.jar
ignoring exception during new ExecutedMojo null
[INFO]
[INFO] --- exec-maven-plugin:1.2.1:java (startTestDb) @ syncope-core ---
The Web Console server could not be started. Possible cause: another server is already running at http://192.168.0.1:8082
[WARNING]
java.lang.reflect.InvocationTargetException
        at sun.reflect.NativeMethodAccessorImpl.invoke0(Native Method)
        at sun.reflect.NativeMethodAccessorImpl.invoke(NativeMethodAccessorImpl.java:39)
        at sun.reflect.DelegatingMethodAccessorImpl.invoke(DelegatingMethodAccessorImpl.java:25)
        at java.lang.reflect.Method.invoke(Method.java:597)
        at org.codehaus.mojo.exec.ExecJavaMojo$1.run(ExecJavaMojo.java:297)
        at java.lang.Thread.run(Thread.java:662)
Caused by: org.h2.jdbc.JdbcSQLException: Exception opening port "8082" (port may be in use), cause: "java.net.BindException: Address already in use" [90061-160]
        at org.h2.message.DbException.getJdbcSQLException(DbException.java:329)
        at org.h2.message.DbException.get(DbException.java:158)
        at org.h2.util.NetUtils.createServerSocketTry(NetUtils.java:181)
        at org.h2.util.NetUtils.createServerSocket(NetUtils.java:147)
        at org.h2.server.web.WebServer.start(WebServer.java:330)
        at org.h2.tools.Server.start(Server.java:362)
        at org.h2.tools.Server.runTool(Server.java:215)
        at org.h2.tools.Server.main(Server.java:115)
        ... 6 more
Caused by: java.net.BindException: Address already in use
        at java.net.PlainSocketImpl.socketBind(Native Method)
        at java.net.PlainSocketImpl.bind(PlainSocketImpl.java:383)
        at java.net.ServerSocket.bind(ServerSocket.java:328)
        at java.net.ServerSocket.<init>(ServerSocket.java:194)
        at java.net.ServerSocket.<init>(ServerSocket.java:106)
        at org.h2.util.NetUtils.createServerSocketTry(NetUtils.java:177)
        ... 11 more
[INFO] ------------------------------------------------------------------------
[INFO] Reactor Summary:
[INFO]
[INFO] Syncope ........................................... SUCCESS [15.427s]
[INFO] Syncope build tools ............................... SUCCESS [16.430s]
[INFO] Syncope client .................................... SUCCESS [28.743s]
[INFO] Syncope core ...................................... FAILURE [40.535s]
[INFO] Syncope console ................................... SKIPPED
[INFO] Syncope archetype ................................. SKIPPED
[INFO] ------------------------------------------------------------------------
[INFO] BUILD FAILURE
[INFO] ------------------------------------------------------------------------
[INFO] Total time: 1:47.966s
[INFO] Finished at: Wed Oct 05 12:53:35 CEST 2011
[INFO] Final Memory: 59M/480M
[INFO] ------------------------------------------------------------------------
mavenExecutionResult exceptions not empty
message : Failed to execute goal org.codehaus.mojo:exec-maven-plugin:1.2.1:java (startTestDb) on project syncope-core: An exception occured while executing the Java class. null
cause : An exception occured while executing the Java class. null
Stack trace :
org.apache.maven.lifecycle.LifecycleExecutionException: Failed to execute goal org.codehaus.mojo:exec-maven-plugin:1.2.1:java (startTestDb) on project syncope-core: An exception occured while executing the Java class. null
        at org.apache.maven.lifecycle.internal.MojoExecutor.execute(MojoExecutor.java:217)
        at org.apache.maven.lifecycle.internal.MojoExecutor.execute(MojoExecutor.java:153)
        at org.apache.maven.lifecycle.internal.MojoExecutor.execute(MojoExecutor.java:145)
        at org.apache.maven.lifecycle.internal.LifecycleModuleBuilder.buildProject(LifecycleModuleBuilder.java:84)
        at org.apache.maven.lifecycle.internal.LifecycleModuleBuilder.buildProject(LifecycleModuleBuilder.java:59)
        at org.apache.maven.lifecycle.internal.LifecycleStarter.singleThreadedBuild(LifecycleStarter.java:183)
        at org.apache.maven.lifecycle.internal.LifecycleStarter.execute(LifecycleStarter.java:161)
        at org.apache.maven.DefaultMaven.doExecute(DefaultMaven.java:319)
        at org.apache.maven.DefaultMaven.execute(DefaultMaven.java:156)
        at org.jvnet.hudson.maven3.launcher.Maven3Launcher.main(Maven3Launcher.java:79)
        at sun.reflect.NativeMethodAccessorImpl.invoke0(Native Method)
        at sun.reflect.NativeMethodAccessorImpl.invoke(NativeMethodAccessorImpl.java:39)
        at sun.reflect.DelegatingMethodAccessorImpl.invoke(DelegatingMethodAccessorImpl.java:25)
        at java.lang.reflect.Method.invoke(Method.java:597)
        at org.codehaus.plexus.classworlds.launcher.Launcher.launchStandard(Launcher.java:329)
        at org.codehaus.plexus.classworlds.launcher.Launcher.launch(Launcher.java:239)
        at org.jvnet.hudson.maven3.agent.Maven3Main.launch(Maven3Main.java:158)
        at hudson.maven.Maven3Builder.call(Maven3Builder.java:122)
        at hudson.maven.Maven3Builder.call(Maven3Builder.java:74)
        at hudson.remoting.UserRequest.perform(UserRequest.java:118)
        at hudson.remoting.UserRequest.perform(UserRequest.java:48)
        at hudson.remoting.Request$2.run(Request.java:287)
        at java.util.concurrent.Executors$RunnableAdapter.call(Executors.java:441)
        at java.util.concurrent.FutureTask$Sync.innerRun(FutureTask.java:303)
        at java.util.concurrent.FutureTask.run(FutureTask.java:138)
        at java.util.concurrent.ThreadPoolExecutor$Worker.runTask(ThreadPoolExecutor.java:886)
        at java.util.concurrent.ThreadPoolExecutor$Worker.run(ThreadPoolExecutor.java:908)
        at java.lang.Thread.run(Thread.java:662)
Caused by: org.apache.maven.plugin.MojoExecutionException: An exception occured while executing the Java class. null
        at org.codehaus.mojo.exec.ExecJavaMojo.execute(ExecJavaMojo.java:352)
        at org.apache.maven.plugin.DefaultBuildPluginManager.executeMojo(DefaultBuildPluginManager.java:101)
        at org.apache.maven.lifecycle.internal.MojoExecutor.execute(MojoExecutor.java:209)
        ... 27 more
Caused by: java.lang.reflect.InvocationTargetException
        at sun.reflect.NativeMethodAccessorImpl.invoke0(Native Method)
        at sun.reflect.NativeMethodAccessorImpl.invoke(NativeMethodAccessorImpl.java:39)
        at sun.reflect.DelegatingMethodAccessorImpl.invoke(DelegatingMethodAccessorImpl.java:25)
        at java.lang.reflect.Method.invoke(Method.java:597)
        at org.codehaus.mojo.exec.ExecJavaMojo$1.run(ExecJavaMojo.java:297)
        ... 1 more
Caused by: org.h2.jdbc.JdbcSQLException: Exception opening port "8082" (port may be in use), cause: "java.net.BindException: Address already in use" [90061-160]
        at org.h2.message.DbException.getJdbcSQLException(DbException.java:329)
        at org.h2.message.DbException.get(DbException.java:158)
        at org.h2.util.NetUtils.createServerSocketTry(NetUtils.java:181)
        at org.h2.util.NetUtils.createServerSocket(NetUtils.java:147)
        at org.h2.server.web.WebServer.start(WebServer.java:330)
        at org.h2.tools.Server.start(Server.java:362)
        at org.h2.tools.Server.runTool(Server.java:215)
        at org.h2.tools.Server.main(Server.java:115)
        ... 6 more
Caused by: java.net.BindException: Address already in use
        at java.net.PlainSocketImpl.socketBind(Native Method)
        at java.net.PlainSocketImpl.bind(PlainSocketImpl.java:383)
        at java.net.ServerSocket.bind(ServerSocket.java:328)
        at java.net.ServerSocket.<init>(ServerSocket.java:194)
        at java.net.ServerSocket.<init>(ServerSocket.java:106)
        at org.h2.util.NetUtils.createServerSocketTry(NetUtils.java:177)
        ... 11 more
[CHECKSTYLE] Aggregating results of Syncope
[CHECKSTYLE] Using set difference to compute new warnings
[CHECKSTYLE] Not changing build status, since no threshold has been exceeded
[CHECKSTYLE] Aggregating results of Syncope build tools
[CHECKSTYLE] Using set difference to compute new warnings
[CHECKSTYLE] Not changing build status, since no threshold has been exceeded
[CHECKSTYLE] Aggregating results of Syncope client
[CHECKSTYLE] Using set difference to compute new warnings
[CHECKSTYLE] Not changing build status, since no threshold has been exceeded
[FINDBUGS] Aggregating results of Syncope
[FINDBUGS] Using set difference to compute new warnings
[FINDBUGS] Not changing build status, since no threshold has been exceeded
[FINDBUGS] Aggregating results of Syncope build tools
[FINDBUGS] Using set difference to compute new warnings
[FINDBUGS] Not changing build status, since no threshold has been exceeded
[FINDBUGS] Aggregating results of Syncope client
[FINDBUGS] Using set difference to compute new warnings
[FINDBUGS] Not changing build status, since no threshold has been exceeded
[PMD] Aggregating results of Syncope
[PMD] Using set difference to compute new warnings
[PMD] Not changing build status, since no threshold has been exceeded
[PMD] Aggregating results of Syncope build tools
[PMD] Using set difference to compute new warnings
[PMD] Not changing build status, since no threshold has been exceeded
[PMD] Aggregating results of Syncope client
[PMD] Using set difference to compute new warnings
[PMD] Not changing build status, since no threshold has been exceeded
Failed to send e-mail to chicchiricco because no e-mail address is known, and no default e-mail domain is configured
Sending e-mails to: [hidden email]
channel stopped
Failed to send e-mail to chicchiricco because no e-mail address is known, and no default e-mail domain is configured

Reply | Threaded
Open this post in threaded view
|

[syncope-dev] Jenkins build is back to normal : Syncope trunk (GNU Linux) #50

jenkins