[syncope-dev] Build failed in Jenkins: Syncope trunk (GNU Linux) #15

classic Classic list List threaded Threaded
1 message Options
Reply | Threaded
Open this post in threaded view
|

[syncope-dev] Build failed in Jenkins: Syncope trunk (GNU Linux) #15

jenkins
See <http://jenkins.syncope-idm.org/job/Syncope%20trunk%20(GNU%20Linux)/15/changes>

Changes:

[chicchiricco] Ignoring archetype's test content.xml in SVN

------------------------------------------
[...truncated 2068 lines...]
[WARNING] Error while parsing <http://jenkins.syncope-idm.org/job/Syncope%20trunk%20(GNU%20Linux)/ws/console/src/main/java/org/syncope/console/wicket/markup/html/form/AjaxDropDownChoicePanel.java>: Can't use annotations when running in JDK 1.4 mode!
[WARNING] Error while parsing <http://jenkins.syncope-idm.org/job/Syncope%20trunk%20(GNU%20Linux)/ws/console/src/main/java/org/syncope/console/wicket/markup/html/form/AjaxDropDownChoicePanel.java>: Can't use annotations when running in JDK 1.4 mode!
[WARNING] Error while parsing <http://jenkins.syncope-idm.org/job/Syncope%20trunk%20(GNU%20Linux)/ws/console/src/main/java/org/syncope/console/wicket/markup/html/form/AjaxTextFieldPanel.java>: Can't use annotations when running in JDK 1.4 mode!
[WARNING] Error while parsing <http://jenkins.syncope-idm.org/job/Syncope%20trunk%20(GNU%20Linux)/ws/console/src/main/java/org/syncope/console/wicket/markup/html/form/AjaxTextFieldPanel.java>: Can't use annotations when running in JDK 1.4 mode!
[WARNING] Error while parsing <http://jenkins.syncope-idm.org/job/Syncope%20trunk%20(GNU%20Linux)/ws/console/src/main/java/org/syncope/console/wicket/markup/html/form/AjaxTextFieldPanel.java>: Can't use annotations when running in JDK 1.4 mode!
[WARNING] Error while parsing <http://jenkins.syncope-idm.org/job/Syncope%20trunk%20(GNU%20Linux)/ws/console/src/main/java/org/syncope/console/wicket/markup/html/form/DateFieldPanel.java>: Can't use generics unless running in JDK 1.5 mode!
[WARNING] Error while parsing <http://jenkins.syncope-idm.org/job/Syncope%20trunk%20(GNU%20Linux)/ws/console/src/main/java/org/syncope/console/wicket/markup/html/form/DateFieldPanel.java>: Can't use generics unless running in JDK 1.5 mode!
[WARNING] Error while parsing <http://jenkins.syncope-idm.org/job/Syncope%20trunk%20(GNU%20Linux)/ws/console/src/main/java/org/syncope/console/wicket/markup/html/form/DateFieldPanel.java>: Can't use generics unless running in JDK 1.5 mode!
[WARNING] Error while parsing <http://jenkins.syncope-idm.org/job/Syncope%20trunk%20(GNU%20Linux)/ws/console/src/main/java/org/syncope/console/wicket/markup/html/form/DeleteLinkPanel.java>: Can't use generics unless running in JDK 1.5 mode!
[WARNING] Error while parsing <http://jenkins.syncope-idm.org/job/Syncope%20trunk%20(GNU%20Linux)/ws/console/src/main/java/org/syncope/console/wicket/markup/html/form/DeleteLinkPanel.java>: Can't use generics unless running in JDK 1.5 mode!
[WARNING] Error while parsing <http://jenkins.syncope-idm.org/job/Syncope%20trunk%20(GNU%20Linux)/ws/console/src/main/java/org/syncope/console/wicket/markup/html/form/DeleteLinkPanel.java>: Can't use generics unless running in JDK 1.5 mode!
[WARNING] Error while parsing <http://jenkins.syncope-idm.org/job/Syncope%20trunk%20(GNU%20Linux)/ws/console/src/main/java/org/syncope/console/wicket/markup/html/form/EditLinkPanel.java>: Can't use generics unless running in JDK 1.5 mode!
[WARNING] Error while parsing <http://jenkins.syncope-idm.org/job/Syncope%20trunk%20(GNU%20Linux)/ws/console/src/main/java/org/syncope/console/wicket/markup/html/form/EditLinkPanel.java>: Can't use generics unless running in JDK 1.5 mode!
[WARNING] Error while parsing <http://jenkins.syncope-idm.org/job/Syncope%20trunk%20(GNU%20Linux)/ws/console/src/main/java/org/syncope/console/wicket/markup/html/form/EditLinkPanel.java>: Can't use generics unless running in JDK 1.5 mode!
[WARNING] Error while parsing <http://jenkins.syncope-idm.org/job/Syncope%20trunk%20(GNU%20Linux)/ws/console/src/main/java/org/syncope/console/wicket/markup/html/form/LinkPanel.java>: Can't use generics unless running in JDK 1.5 mode!
[WARNING] Error while parsing <http://jenkins.syncope-idm.org/job/Syncope%20trunk%20(GNU%20Linux)/ws/console/src/main/java/org/syncope/console/wicket/markup/html/form/LinkPanel.java>: Can't use generics unless running in JDK 1.5 mode!
[WARNING] Error while parsing <http://jenkins.syncope-idm.org/job/Syncope%20trunk%20(GNU%20Linux)/ws/console/src/main/java/org/syncope/console/wicket/markup/html/form/LinkPanel.java>: Can't use generics unless running in JDK 1.5 mode!
[WARNING] Error while parsing <http://jenkins.syncope-idm.org/job/Syncope%20trunk%20(GNU%20Linux)/ws/console/src/main/java/org/syncope/console/wicket/markup/html/tree/NodeEditablePanel.java>: Can't use annotations when running in JDK 1.4 mode!
[WARNING] Error while parsing <http://jenkins.syncope-idm.org/job/Syncope%20trunk%20(GNU%20Linux)/ws/console/src/main/java/org/syncope/console/wicket/markup/html/tree/NodeEditablePanel.java>: Can't use annotations when running in JDK 1.4 mode!
[WARNING] Error while parsing <http://jenkins.syncope-idm.org/job/Syncope%20trunk%20(GNU%20Linux)/ws/console/src/main/java/org/syncope/console/wicket/markup/html/tree/NodeEditablePanel.java>: Can't use annotations when running in JDK 1.4 mode!
[WARNING] Error while parsing <http://jenkins.syncope-idm.org/job/Syncope%20trunk%20(GNU%20Linux)/ws/console/src/main/java/org/syncope/console/wicket/markup/html/tree/PropertyEditableColumn.java>: Can't use annotations when running in JDK 1.4 mode!
[WARNING] Error while parsing <http://jenkins.syncope-idm.org/job/Syncope%20trunk%20(GNU%20Linux)/ws/console/src/main/java/org/syncope/console/wicket/markup/html/tree/PropertyEditableColumn.java>: Can't use annotations when running in JDK 1.4 mode!
[WARNING] Error while parsing <http://jenkins.syncope-idm.org/job/Syncope%20trunk%20(GNU%20Linux)/ws/console/src/main/java/org/syncope/console/wicket/markup/html/tree/PropertyEditableColumn.java>: Can't use annotations when running in JDK 1.4 mode!
[PMD] Successfully parsed file <http://jenkins.syncope-idm.org/job/Syncope%20trunk%20(GNU%20Linux)/ws/console/target/pmd.xml> of module Syncope console with 2 warnings.
[PMD] Using set difference to compute new warnings
[PMD] Not changing build status, since no threshold has been exceeded
[INFO]
[INFO] --- maven-checkstyle-plugin:2.7:checkstyle (default-cli) @ syncope-console ---
[INFO]
[INFO] There are 1302 checkstyle errors.
[WARNING] Unable to locate Source XRef to link to - DISABLED
[CHECKSTYLE] Successfully parsed file <http://jenkins.syncope-idm.org/job/Syncope%20trunk%20(GNU%20Linux)/ws/console/target/checkstyle-result.xml> of module Syncope console with 1302 warnings.
[CHECKSTYLE] Using set difference to compute new warnings
[CHECKSTYLE] Not changing build status, since no threshold has been exceeded
[INFO] ****** FindBugsMojo execute *******
[INFO] canGenerate is true
[INFO] ****** FindBugsMojo executeFindbugs *******
[INFO] Temp File is <http://jenkins.syncope-idm.org/job/Syncope%20trunk%20(GNU%20Linux)/ws/console/target/findbugsTemp.xml>
[INFO] Fork Value is true
[INFO]
[INFO] --- findbugs-maven-plugin:2.3.2:findbugs (default-cli) @ syncope-console ---
     [java] The following classes needed for analysis were missing:
     [java]   javax.portlet.GenericPortlet
     [java]   javax.portlet.PortletRequest
     [java]   javax.portlet.MimeResponse
     [java]   javax.portlet.PortletURL
     [java]   javax.portlet.PortletMode
     [java]   javax.portlet.ResourceURL
     [java]   javax.portlet.PortletResponse
     [java] Warnings generated: 61
     [java] Missing classes: 7
[INFO] xmlOutput is false
[FINDBUGS] Using set difference to compute new warnings
[FINDBUGS] Not changing build status, since no threshold has been exceeded
projectSucceeded org.syncope:syncope-console:0.7-SNAPSHOT
[JENKINS] Archiving <http://jenkins.syncope-idm.org/job/Syncope%20trunk%20(GNU%20Linux)/ws/console/pom.xml> to /var/lib/jenkins/jobs/Syncope trunk (GNU Linux)/modules/org.syncope$syncope-console/builds/2011-09-01_10-32-49/archive/org.syncope/syncope-console/0.7-SNAPSHOT/syncope-console-0.7-SNAPSHOT.pom
[JENKINS] Archiving <http://jenkins.syncope-idm.org/job/Syncope%20trunk%20(GNU%20Linux)/ws/console/target/syncope-console.war> to /var/lib/jenkins/jobs/Syncope trunk (GNU Linux)/modules/org.syncope$syncope-console/builds/2011-09-01_10-32-49/archive/org.syncope/syncope-console/0.7-SNAPSHOT/syncope-console-0.7-SNAPSHOT.war
[JENKINS] Archiving <http://jenkins.syncope-idm.org/job/Syncope%20trunk%20(GNU%20Linux)/ws/console/target/syncope-console-classes.jar> to /var/lib/jenkins/jobs/Syncope trunk (GNU Linux)/modules/org.syncope$syncope-console/builds/2011-09-01_10-32-49/archive/org.syncope/syncope-console/0.7-SNAPSHOT/syncope-console-0.7-SNAPSHOT-classes.jar
[INFO]                                                                        
[INFO] ------------------------------------------------------------------------
[INFO] Building Syncope archetype 0.7-SNAPSHOT
[INFO] ------------------------------------------------------------------------
[INFO]
[INFO] --- maven-clean-plugin:2.4.1:clean (default-clean) @ syncope-archetype ---
[INFO]
[INFO] --- maven-enforcer-plugin:1.0:enforce (enforce-maven) @ syncope-archetype ---
[INFO]
[INFO] --- maven-resources-plugin:2.5:resources (default-resources) @ syncope-archetype ---
[debug] execute contextualize
[INFO] Using 'UTF-8' encoding to copy filtered resources.
[INFO] Copying 14 resources
[INFO]
[INFO] --- maven-resources-plugin:2.5:testResources (default-testResources) @ syncope-archetype ---
[debug] execute contextualize
[INFO] Using 'UTF-8' encoding to copy filtered resources.
[INFO] Copying 2 resources
[INFO]
[INFO] --- maven-antrun-plugin:1.6:run (setupTestContentXML) @ syncope-archetype ---
[INFO] Executing tasks

main:
     [copy] Copying 1 file to <http://jenkins.syncope-idm.org/job/Syncope%20trunk%20(GNU%20Linux)/ws/archetype/src/main/resources/archetype-resources/core/src/test/resources>
[INFO] Executed tasks
[INFO]
[INFO] --- maven-archetype-plugin:2.0:jar (default-jar) @ syncope-archetype ---
[INFO]
[INFO] --- maven-archetype-plugin:2.0:add-archetype-metadata (default-add-archetype-metadata) @ syncope-archetype ---
[INFO]
[INFO] --- maven-archetype-plugin:2.0:integration-test (default-integration-test) @ syncope-archetype ---
[INFO] Parent element not overwritten in <http://jenkins.syncope-idm.org/job/Syncope%20trunk%20(GNU%20Linux)/ws/archetype/target/test-classes/projects/basic/project/basic/core/pom.xml>
[INFO] Parent element not overwritten in <http://jenkins.syncope-idm.org/job/Syncope%20trunk%20(GNU%20Linux)/ws/archetype/target/test-classes/projects/basic/project/basic/console/pom.xml>
[INFO]
[INFO] --- maven-pmd-plugin:2.5:pmd (default-cli) @ syncope-archetype ---
[WARNING] Unable to locate Source XRef to link to - DISABLED
[PMD] Successfully parsed file <http://jenkins.syncope-idm.org/job/Syncope%20trunk%20(GNU%20Linux)/ws/archetype/target/pmd.xml> of module Syncope archetype with 0 warnings.
[PMD] Using set difference to compute new warnings
[PMD] Not changing build status, since no threshold has been exceeded
[INFO]
[INFO] --- maven-checkstyle-plugin:2.7:checkstyle (default-cli) @ syncope-archetype ---
[CHECKSTYLE] Using set difference to compute new warnings
[CHECKSTYLE] Not changing build status, since no threshold has been exceeded
[INFO]
[INFO] --- findbugs-maven-plugin:2.3.2:findbugs (default-cli) @ syncope-archetype ---
[INFO] ****** FindBugsMojo execute *******
[INFO] canGenerate is false
[FINDBUGS] Using set difference to compute new warnings
[FINDBUGS] Not changing build status, since no threshold has been exceeded
projectSucceeded org.syncope:syncope-archetype:0.7-SNAPSHOT
[JENKINS] Archiving <http://jenkins.syncope-idm.org/job/Syncope%20trunk%20(GNU%20Linux)/ws/archetype/pom.xml> to /var/lib/jenkins/jobs/Syncope trunk (GNU Linux)/modules/org.syncope$syncope-archetype/builds/2011-09-01_10-32-49/archive/org.syncope/syncope-archetype/0.7-SNAPSHOT/syncope-archetype-0.7-SNAPSHOT.pom
[JENKINS] Archiving <http://jenkins.syncope-idm.org/job/Syncope%20trunk%20(GNU%20Linux)/ws/archetype/target/syncope-archetype-0.7-SNAPSHOT.jar> to /var/lib/jenkins/jobs/Syncope trunk (GNU Linux)/modules/org.syncope$syncope-archetype/builds/2011-09-01_10-32-49/archive/org.syncope/syncope-archetype/0.7-SNAPSHOT/syncope-archetype-0.7-SNAPSHOT.jar
sessionEnded
[INFO] ------------------------------------------------------------------------
[INFO] Reactor Summary:
[INFO]
[INFO] Syncope ........................................... SUCCESS [9.308s]
[INFO] Syncope build tools ............................... SUCCESS [6.286s]
[INFO] Syncope client .................................... SUCCESS [21.394s]
[INFO] Syncope core ...................................... SUCCESS [2:00.504s]
[INFO] Syncope console ................................... SUCCESS [31.597s]
[INFO] Syncope archetype ................................. SUCCESS [2.459s]
[INFO] ------------------------------------------------------------------------
[INFO] BUILD SUCCESS
[INFO] ------------------------------------------------------------------------
[INFO] Total time: 3:24.534s
[INFO] Finished at: Thu Sep 01 10:36:18 CEST 2011
[INFO] Final Memory: 89M/493M
[INFO] ------------------------------------------------------------------------
[CHECKSTYLE] Aggregating results of Syncope
[CHECKSTYLE] Using set difference to compute new warnings
[CHECKSTYLE] Not changing build status, since no threshold has been exceeded
[CHECKSTYLE] Aggregating results of Syncope build tools
[CHECKSTYLE] Using set difference to compute new warnings
[CHECKSTYLE] Not changing build status, since no threshold has been exceeded
[CHECKSTYLE] Aggregating results of Syncope client
[CHECKSTYLE] Using set difference to compute new warnings
[CHECKSTYLE] Not changing build status, since no threshold has been exceeded
[CHECKSTYLE] Aggregating results of Syncope core
[CHECKSTYLE] Using set difference to compute new warnings
[CHECKSTYLE] Not changing build status, since no threshold has been exceeded
[CHECKSTYLE] Aggregating results of Syncope console
[CHECKSTYLE] Using set difference to compute new warnings
[CHECKSTYLE] Not changing build status, since no threshold has been exceeded
[CHECKSTYLE] Aggregating results of Syncope archetype
[CHECKSTYLE] Using set difference to compute new warnings
[CHECKSTYLE] Not changing build status, since no threshold has been exceeded
[FINDBUGS] Aggregating results of Syncope
[FINDBUGS] Using set difference to compute new warnings
[FINDBUGS] Not changing build status, since no threshold has been exceeded
[FINDBUGS] Aggregating results of Syncope build tools
[FINDBUGS] Using set difference to compute new warnings
[FINDBUGS] Not changing build status, since no threshold has been exceeded
[FINDBUGS] Aggregating results of Syncope client
[FINDBUGS] Using set difference to compute new warnings
[FINDBUGS] Not changing build status, since no threshold has been exceeded
[FINDBUGS] Aggregating results of Syncope core
[FINDBUGS] Using set difference to compute new warnings
[FINDBUGS] Not changing build status, since no threshold has been exceeded
[FINDBUGS] Aggregating results of Syncope console
[FINDBUGS] Using set difference to compute new warnings
[FINDBUGS] Not changing build status, since no threshold has been exceeded
[FINDBUGS] Aggregating results of Syncope archetype
[FINDBUGS] Using set difference to compute new warnings
[FINDBUGS] Not changing build status, since no threshold has been exceeded
[PMD] Aggregating results of Syncope
[PMD] Using set difference to compute new warnings
[PMD] Not changing build status, since no threshold has been exceeded
[PMD] Aggregating results of Syncope build tools
[PMD] Using set difference to compute new warnings
[PMD] Not changing build status, since no threshold has been exceeded
[PMD] Aggregating results of Syncope client
[PMD] Using set difference to compute new warnings
[PMD] Not changing build status, since no threshold has been exceeded
[PMD] Aggregating results of Syncope core
[PMD] Using set difference to compute new warnings
[PMD] Not changing build status, since no threshold has been exceeded
[PMD] Aggregating results of Syncope console
[PMD] Using set difference to compute new warnings
[PMD] Not changing build status, since no threshold has been exceeded
[PMD] Aggregating results of Syncope archetype
[PMD] Using set difference to compute new warnings
[PMD] Not changing build status, since no threshold has been exceeded
channel stopped
 your Apache Maven build is setup to use a config with id  but cannot find the config
 your Apache Maven build is setup to use a global settings config with id  but cannot find the config
Maven RedeployPublished use remote  maven settings from : /var/lib/jenkins/.m2/settings.xml
[INFO] Deployment in https://oss.sonatype.org/content/repositories/snapshots/ (id=sonatype-nexus-snapshots,uniqueVersion=true)
Deploying the main artifact syncope-0.7-SNAPSHOT.pom
Downloading: https://oss.sonatype.org/content/repositories/snapshots/org/syncope/syncope/0.7-SNAPSHOT/maven-metadata.xml
593 B  
       
Downloaded: https://oss.sonatype.org/content/repositories/snapshots/org/syncope/syncope/0.7-SNAPSHOT/maven-metadata.xml (593 B at 0.0 KB/sec)
Uploading: https://oss.sonatype.org/content/repositories/snapshots/org/syncope/syncope/0.7-SNAPSHOT/syncope-0.7-20110901.083736-14.pom
4 KB    
8 KB  
12 KB  
16 KB  
20 KB  
24 KB  
26 KB  
       
Uploaded: https://oss.sonatype.org/content/repositories/snapshots/org/syncope/syncope/0.7-SNAPSHOT/syncope-0.7-20110901.083736-14.pom (26 KB at 0.4 KB/sec)
Uploading: https://oss.sonatype.org/content/repositories/snapshots/org/syncope/syncope/0.7-SNAPSHOT/syncope-0.7-20110901.083736-14.pom
4 KB    
8 KB  
12 KB  
16 KB  
20 KB  
24 KB  
26 KB  
       
ERROR: Failed to deploy artifacts: Could not transfer artifact org.syncope:syncope:pom:0.7-20110901.083736-14 from/to sonatype-nexus-snapshots (https://oss.sonatype.org/content/repositories/snapshots/): Failed to transfer file: https://oss.sonatype.org/content/repositories/snapshots/org/syncope/syncope/0.7-SNAPSHOT/syncope-0.7-20110901.083736-14.pom. Return code is: 504
org.apache.maven.artifact.deployer.ArtifactDeploymentException: Failed to deploy artifacts: Could not transfer artifact org.syncope:syncope:pom:0.7-20110901.083736-14 from/to sonatype-nexus-snapshots (https://oss.sonatype.org/content/repositories/snapshots/): Failed to transfer file: https://oss.sonatype.org/content/repositories/snapshots/org/syncope/syncope/0.7-SNAPSHOT/syncope-0.7-20110901.083736-14.pom. Return code is: 504
        at org.apache.maven.artifact.deployer.DefaultArtifactDeployer.deploy(DefaultArtifactDeployer.java:141)
        at hudson.maven.reporters.MavenArtifactRecord.deploy(MavenArtifactRecord.java:189)
        at hudson.maven.RedeployPublisher.perform(RedeployPublisher.java:152)
        at hudson.tasks.BuildStepMonitor$1.perform(BuildStepMonitor.java:19)
        at hudson.model.AbstractBuild$AbstractRunner.perform(AbstractBuild.java:682)
        at hudson.model.AbstractBuild$AbstractRunner.performAllBuildSteps(AbstractBuild.java:657)
        at hudson.maven.MavenModuleSetBuild$RunnerImpl.post2(MavenModuleSetBuild.java:958)
        at hudson.model.AbstractBuild$AbstractRunner.post(AbstractBuild.java:604)
        at hudson.model.Run.run(Run.java:1401)
        at hudson.maven.MavenModuleSetBuild.run(MavenModuleSetBuild.java:479)
        at hudson.model.ResourceController.execute(ResourceController.java:88)
        at hudson.model.Executor.run(Executor.java:230)
Caused by: org.sonatype.aether.deployment.DeploymentException: Failed to deploy artifacts: Could not transfer artifact org.syncope:syncope:pom:0.7-20110901.083736-14 from/to sonatype-nexus-snapshots (https://oss.sonatype.org/content/repositories/snapshots/): Failed to transfer file: https://oss.sonatype.org/content/repositories/snapshots/org/syncope/syncope/0.7-SNAPSHOT/syncope-0.7-20110901.083736-14.pom. Return code is: 504
        at org.sonatype.aether.impl.internal.DefaultDeployer.deploy(DefaultDeployer.java:284)
        at org.sonatype.aether.impl.internal.DefaultDeployer.deploy(DefaultDeployer.java:215)
        at org.sonatype.aether.impl.internal.DefaultRepositorySystem.deploy(DefaultRepositorySystem.java:480)
        at org.apache.maven.artifact.deployer.DefaultArtifactDeployer.deploy(DefaultArtifactDeployer.java:137)
        ... 11 more
Caused by: org.sonatype.aether.transfer.ArtifactTransferException: Could not transfer artifact org.syncope:syncope:pom:0.7-20110901.083736-14 from/to sonatype-nexus-snapshots (https://oss.sonatype.org/content/repositories/snapshots/): Failed to transfer file: https://oss.sonatype.org/content/repositories/snapshots/org/syncope/syncope/0.7-SNAPSHOT/syncope-0.7-20110901.083736-14.pom. Return code is: 504
        at org.sonatype.aether.connector.wagon.WagonRepositoryConnector$4.wrap(WagonRepositoryConnector.java:949)
        at org.sonatype.aether.connector.wagon.WagonRepositoryConnector$4.wrap(WagonRepositoryConnector.java:940)
        at org.sonatype.aether.connector.wagon.WagonRepositoryConnector$PutTask.flush(WagonRepositoryConnector.java:864)
        at org.sonatype.aether.connector.wagon.WagonRepositoryConnector.put(WagonRepositoryConnector.java:466)
        at org.sonatype.aether.impl.internal.DefaultDeployer.deploy(DefaultDeployer.java:278)
        ... 14 more
Caused by: org.apache.maven.wagon.TransferFailedException: Failed to transfer file: https://oss.sonatype.org/content/repositories/snapshots/org/syncope/syncope/0.7-SNAPSHOT/syncope-0.7-20110901.083736-14.pom. Return code is: 504
        at org.apache.maven.wagon.providers.http.LightweightHttpWagon.finishPutTransfer(LightweightHttpWagon.java:205)
        at org.apache.maven.wagon.AbstractWagon.putTransfer(AbstractWagon.java:413)
        at org.apache.maven.wagon.AbstractWagon.transfer(AbstractWagon.java:392)
        at org.apache.maven.wagon.AbstractWagon.putTransfer(AbstractWagon.java:365)
        at org.apache.maven.wagon.StreamWagon.put(StreamWagon.java:163)
        at org.sonatype.aether.connector.wagon.WagonRepositoryConnector$PutTask.run(WagonRepositoryConnector.java:825)
        at org.sonatype.aether.connector.wagon.WagonRepositoryConnector.put(WagonRepositoryConnector.java:465)
        ... 15 more
[INFO] Deployment failed after 7 min 35 sec
Build step 'Deploy artifacts to Maven repository' changed build result to FAILURE
Failed to send e-mail to chicchiricco because no e-mail address is known, and no default e-mail domain is configured