[syncope-dev] Build failed in Jenkins: Syncope trunk (GNU Linux) #11

classic Classic list List threaded Threaded
3 messages Options
Reply | Threaded
Open this post in threaded view
|  
Report Content as Inappropriate

[syncope-dev] Build failed in Jenkins: Syncope trunk (GNU Linux) #11

jenkins
See <http://jenkins.syncope-idm.org/job/Syncope%20trunk%20(GNU%20Linux)/11/changes>

Changes:

[chicchiricco] Fixing site reports

------------------------------------------
[...truncated 658 lines...]
A         core/src/main/resources
A         core/src/main/resources/ehcache.xml
A         core/src/main/resources/persistence.properties
A         core/src/main/resources/restContext.xml
A         core/src/main/resources/syncopeContext.xml
A         core/src/main/resources/quartz
A         core/src/main/resources/quartz/tables_hsqldb.sql
A         core/src/main/resources/quartz/tables_mysql_innodb.sql
A         core/src/main/resources/quartz/tables_oracle.sql
A         core/src/main/resources/quartz/tables_mysql.sql
A         core/src/main/resources/quartz/tables_postgres.sql
A         core/src/main/resources/persistenceContext.xml
A         core/src/main/resources/schedulingContext.xml
A         core/src/main/resources/views.xml
A         core/src/main/resources/workflows.xml
A         core/src/main/resources/indexes.xml
A         core/src/main/resources/META-INF
A         core/src/main/resources/META-INF/propertyset.xml
A         core/src/main/resources/META-INF/orm.xml.oracle
A         core/src/main/resources/META-INF/services
A         core/src/main/resources/META-INF/services/org.identityconnectors.common.logging
A         core/src/main/resources/META-INF/persistence.xml
A         core/src/main/resources/META-INF/orm.xml
A         core/src/main/resources/logback.xml
A         core/src/main/resources/mailTemplates
A         core/src/main/resources/mailTemplates/optin.txt.vm
A         core/src/main/resources/mailTemplates/optin.html.vm
A         core/src/main/resources/security.properties
A         core/src/main/resources/userWorkflow.xml
A         core/src/main/resources/content.xml
A         core/src/main/resources/securityContext.xml
A         core/src/main/resources/workflowContext.xml
A         core/src/main/webapp
A         core/src/main/webapp/version.jsp
A         core/src/main/webapp/dbExport.jsp
A         core/src/main/webapp/syncopeClientError.jsp
A         core/src/main/webapp/WEB-INF
A         core/src/main/webapp/WEB-INF/sun-web.xml
A         core/src/main/webapp/WEB-INF/web.xml
A         core/src/main/webapp/hibernateStats.jsp
A         core/pom.xml
A         pom.xml
A         build-tools
A         build-tools/src
A         build-tools/src/main
A         build-tools/src/main/resources
A         build-tools/src/main/resources/org
A         build-tools/src/main/resources/org/syncope
A         build-tools/src/main/resources/org/syncope/checkstyle.xml
A         build-tools/pom.xml
A         client
A         client/src
A         client/src/test
A         client/src/test/java
A         client/src/test/java/org
A         client/src/test/java/org/syncope
A         client/src/test/java/org/syncope/client
A         client/src/test/java/org/syncope/client/test
A         client/src/test/java/org/syncope/client/test/JSONTest.java
A         client/src/test/resources
A         client/src/main
A         client/src/main/java
A         client/src/main/java/org
A         client/src/main/java/org/syncope
A         client/src/main/java/org/syncope/types
A         client/src/main/java/org/syncope/types/PropagationTaskExecStatus.java
A         client/src/main/java/org/syncope/types/SyncopeClientExceptionType.java
A         client/src/main/java/org/syncope/types/CipherAlgorithm.java
A         client/src/main/java/org/syncope/types/PolicyType.java
A         client/src/main/java/org/syncope/types/SchemaType.java
A         client/src/main/java/org/syncope/types/EntityViolationType.java
A         client/src/main/java/org/syncope/types/AbstractPolicy.java
A         client/src/main/java/org/syncope/types/ConnConfPropSchema.java
A         client/src/main/java/org/syncope/types/SyntaxPolicy.java
A         client/src/main/java/org/syncope/types/TraceLevel.java
A         client/src/main/java/org/syncope/types/ConnConfProperty.java
A         client/src/main/java/org/syncope/types/PropagationMode.java
A         client/src/main/java/org/syncope/types/ResourceOperationType.java
A         client/src/main/java/org/syncope/types/ConnectorCapability.java
A         client/src/main/java/org/syncope/types/SourceMappingType.java
A         client/src/main/java/org/syncope/client
A         client/src/main/java/org/syncope/client/mod
A         client/src/main/java/org/syncope/client/mod/SyncTaskMod.java
A         client/src/main/java/org/syncope/client/mod/RoleMod.java
A         client/src/main/java/org/syncope/client/mod/AttributeMod.java
A         client/src/main/java/org/syncope/client/mod/AbstractAttributableMod.java
A         client/src/main/java/org/syncope/client/mod/SchedTaskMod.java
A         client/src/main/java/org/syncope/client/mod/MembershipMod.java
A         client/src/main/java/org/syncope/client/mod/UserMod.java
A         client/src/main/java/org/syncope/client/to
A         client/src/main/java/org/syncope/client/to/SyncTaskTO.java
A         client/src/main/java/org/syncope/client/to/SchemaTO.java
A         client/src/main/java/org/syncope/client/to/RoleTO.java
A         client/src/main/java/org/syncope/client/to/TaskTO.java
A         client/src/main/java/org/syncope/client/to/AttributeTO.java
A         client/src/main/java/org/syncope/client/to/DerivedSchemaTO.java
A         client/src/main/java/org/syncope/client/to/PropagationTaskTO.java
A         client/src/main/java/org/syncope/client/to/AbstractAttributableTO.java
A         client/src/main/java/org/syncope/client/to/TaskExecTO.java
A         client/src/main/java/org/syncope/client/to/VirtualSchemaTO.java
A         client/src/main/java/org/syncope/client/to/ConfigurationTO.java
A         client/src/main/java/org/syncope/client/to/SchedTaskTO.java
A         client/src/main/java/org/syncope/client/to/SchemaMappingTO.java
A         client/src/main/java/org/syncope/client/to/UserTO.java
A         client/src/main/java/org/syncope/client/to/LoggerTO.java
A         client/src/main/java/org/syncope/client/to/ConnInstanceTO.java
A         client/src/main/java/org/syncope/client/to/ConnBundleTO.java
A         client/src/main/java/org/syncope/client/to/ResourceTO.java
A         client/src/main/java/org/syncope/client/to/MembershipTO.java
A         client/src/main/java/org/syncope/client/to/WorkflowActionsTO.java
A         client/src/main/java/org/syncope/client/AbstractBaseBean.java
A         client/src/main/java/org/syncope/client/search
A         client/src/main/java/org/syncope/client/search/MembershipCond.java
A         client/src/main/java/org/syncope/client/search/AttributeCond.java
A         client/src/main/java/org/syncope/client/search/NodeCond.java
A         client/src/main/java/org/syncope/client/search/ResourceCond.java
A         client/src/main/java/org/syncope/client/validation
A         client/src/main/java/org/syncope/client/validation/SyncopeClientErrorHandler.java
A         client/src/main/java/org/syncope/client/validation/SyncopeClientCompositeErrorException.java
A         client/src/main/java/org/syncope/client/validation/SyncopeClientException.java
A         client/src/main/resources
A         client/pom.xml
 U        .
At revision 1153
 your Apache Maven build is setup to use a config with id  but cannot find the config
 your Apache Maven build is setup to use a global settings config with id  but cannot find the config
Parsing POMs
Discovered a new module org.syncope:syncope-build-tools Syncope build tools
Modules changed, recalculating dependency graph
[Syncope trunk (GNU Linux)] $ /usr/lib/jvm/java-6-sun/bin/java -Xms512m -Xmx1024m -XX:PermSize=256m -XX:MaxPermSize=512m -cp /var/lib/jenkins/plugins/maven-plugin/WEB-INF/lib/maven3-agent-1.2.jar:/opt/apache-maven-3.0.3/boot/plexus-classworlds-2.4.jar org.jvnet.hudson.maven3.agent.Maven3Main /opt/apache-maven-3.0.3 /var/run/jenkins/war/WEB-INF/lib/remoting-2.4.jar /var/lib/jenkins/plugins/maven-plugin/WEB-INF/lib/maven3-interceptor-1.2.jar 59817
<===[JENKINS REMOTING CAPACITY]===>   channel started
Executing Maven:  -B -f <http://jenkins.syncope-idm.org/job/Syncope%20trunk%20(GNU%20Linux)/ws/pom.xml> clean verify pmd:pmd checkstyle:checkstyle findbugs:findbugs
[INFO] Scanning for projects...
[INFO] ------------------------------------------------------------------------
[INFO] Reactor Build Order:
[INFO]
[INFO] Syncope
[INFO] Syncope build tools
[INFO] Syncope client
[INFO] Syncope core
[INFO] Syncope console
[INFO] Syncope archetype
Downloading: http://repo1.maven.org/maven2/org/apache/maven/plugins/maven-pmd-plugin/maven-metadata.xml
Downloaded: http://repo1.maven.org/maven2/org/apache/maven/plugins/maven-pmd-plugin/maven-metadata.xml (559 B at 1.5 KB/sec)
[INFO]                                                                        
[INFO] ------------------------------------------------------------------------
[INFO] Building Syncope 0.7-SNAPSHOT
[INFO] ------------------------------------------------------------------------
[INFO]
[INFO] --- maven-clean-plugin:2.4.1:clean (default-clean) @ syncope ---
[INFO]
[INFO] --- maven-enforcer-plugin:1.0:enforce (enforce-maven) @ syncope ---
[INFO]
[INFO] --- maven-pmd-plugin:2.5:pmd (default-cli) @ syncope ---
[PMD] Using set difference to compute new warnings
[PMD] Not changing build status, since no threshold has been exceeded
[INFO]
[INFO] --- maven-checkstyle-plugin:2.7:checkstyle (default-cli) @ syncope ---
Downloading: http://repository.apache.org/snapshots/org/syncope/syncope-build-tools/0.7-SNAPSHOT/maven-metadata.xml
Downloading: http://repository.apache.org/snapshots/org/syncope/syncope-build-tools/0.7-SNAPSHOT/syncope-build-tools-0.7-SNAPSHOT.jar
mojoFailed org.apache.maven.plugins:maven-checkstyle-plugin:2.7(default-cli)
ignoring exception during new ExecutedMojo null
[CHECKSTYLE] Using set difference to compute new warnings
[CHECKSTYLE] Not changing build status, since no threshold has been exceeded
projectFailed org.syncope:syncope:0.7-SNAPSHOT
[JENKINS] Archiving <http://jenkins.syncope-idm.org/job/Syncope%20trunk%20(GNU%20Linux)/ws/pom.xml> to /var/lib/jenkins/jobs/Syncope trunk (GNU Linux)/modules/org.syncope$syncope/builds/2011-08-31_16-54-27/archive/org.syncope/syncope/0.7-SNAPSHOT/syncope-0.7-SNAPSHOT.pom
sessionEnded
[INFO] ------------------------------------------------------------------------
[INFO] Reactor Summary:
[INFO]
[INFO] Syncope ........................................... FAILURE [6.441s]
[INFO] Syncope build tools ............................... SKIPPED
[INFO] Syncope client .................................... SKIPPED
[INFO] Syncope core ...................................... SKIPPED
[INFO] Syncope console ................................... SKIPPED
[INFO] Syncope archetype ................................. SKIPPED
[INFO] ------------------------------------------------------------------------
[INFO] BUILD FAILURE
[INFO] ------------------------------------------------------------------------
[INFO] Total time: 11.227s
[INFO] Finished at: Wed Aug 31 16:54:42 CEST 2011
[INFO] Final Memory: 15M/490M
[INFO] ------------------------------------------------------------------------
mavenExecutionResult exceptions not empty
message : Failed to execute goal org.apache.maven.plugins:maven-checkstyle-plugin:2.7:checkstyle (default-cli) on project syncope: Execution default-cli of goal org.apache.maven.plugins:maven-checkstyle-plugin:2.7:checkstyle failed: Plugin org.apache.maven.plugins:maven-checkstyle-plugin:2.7 or one of its dependencies could not be resolved: Could not find artifact org.syncope:syncope-build-tools:jar:0.7-SNAPSHOT in apache.snapshots (http://repository.apache.org/snapshots)
cause : Execution default-cli of goal org.apache.maven.plugins:maven-checkstyle-plugin:2.7:checkstyle failed: Plugin org.apache.maven.plugins:maven-checkstyle-plugin:2.7 or one of its dependencies could not be resolved: Could not find artifact org.syncope:syncope-build-tools:jar:0.7-SNAPSHOT in apache.snapshots (http://repository.apache.org/snapshots)
Stack trace :
org.apache.maven.lifecycle.LifecycleExecutionException: Failed to execute goal org.apache.maven.plugins:maven-checkstyle-plugin:2.7:checkstyle (default-cli) on project syncope: Execution default-cli of goal org.apache.maven.plugins:maven-checkstyle-plugin:2.7:checkstyle failed: Plugin org.apache.maven.plugins:maven-checkstyle-plugin:2.7 or one of its dependencies could not be resolved: Could not find artifact org.syncope:syncope-build-tools:jar:0.7-SNAPSHOT in apache.snapshots (http://repository.apache.org/snapshots)
        at org.apache.maven.lifecycle.internal.MojoExecutor.execute(MojoExecutor.java:225)
        at org.apache.maven.lifecycle.internal.MojoExecutor.execute(MojoExecutor.java:153)
        at org.apache.maven.lifecycle.internal.MojoExecutor.execute(MojoExecutor.java:145)
        at org.apache.maven.lifecycle.internal.LifecycleModuleBuilder.buildProject(LifecycleModuleBuilder.java:84)
        at org.apache.maven.lifecycle.internal.LifecycleModuleBuilder.buildProject(LifecycleModuleBuilder.java:59)
        at org.apache.maven.lifecycle.internal.LifecycleStarter.singleThreadedBuild(LifecycleStarter.java:183)
        at org.apache.maven.lifecycle.internal.LifecycleStarter.execute(LifecycleStarter.java:161)
        at org.apache.maven.DefaultMaven.doExecute(DefaultMaven.java:319)
        at org.apache.maven.DefaultMaven.execute(DefaultMaven.java:156)
        at org.jvnet.hudson.maven3.launcher.Maven3Launcher.main(Maven3Launcher.java:79)
        at sun.reflect.NativeMethodAccessorImpl.invoke0(Native Method)
        at sun.reflect.NativeMethodAccessorImpl.invoke(NativeMethodAccessorImpl.java:39)
        at sun.reflect.DelegatingMethodAccessorImpl.invoke(DelegatingMethodAccessorImpl.java:25)
        at java.lang.reflect.Method.invoke(Method.java:597)
        at org.codehaus.plexus.classworlds.launcher.Launcher.launchStandard(Launcher.java:329)
        at org.codehaus.plexus.classworlds.launcher.Launcher.launch(Launcher.java:239)
        at org.jvnet.hudson.maven3.agent.Maven3Main.launch(Maven3Main.java:158)
        at hudson.maven.Maven3Builder.call(Maven3Builder.java:121)
        at hudson.maven.Maven3Builder.call(Maven3Builder.java:73)
        at hudson.remoting.UserRequest.perform(UserRequest.java:118)
        at hudson.remoting.UserRequest.perform(UserRequest.java:48)
        at hudson.remoting.Request$2.run(Request.java:287)
        at java.util.concurrent.Executors$RunnableAdapter.call(Executors.java:441)
        at java.util.concurrent.FutureTask$Sync.innerRun(FutureTask.java:303)
        at java.util.concurrent.FutureTask.run(FutureTask.java:138)
        at java.util.concurrent.ThreadPoolExecutor$Worker.runTask(ThreadPoolExecutor.java:886)
        at java.util.concurrent.ThreadPoolExecutor$Worker.run(ThreadPoolExecutor.java:908)
        at java.lang.Thread.run(Thread.java:662)
Caused by: org.apache.maven.plugin.PluginExecutionException: Execution default-cli of goal org.apache.maven.plugins:maven-checkstyle-plugin:2.7:checkstyle failed: Plugin org.apache.maven.plugins:maven-checkstyle-plugin:2.7 or one of its dependencies could not be resolved: Could not find artifact org.syncope:syncope-build-tools:jar:0.7-SNAPSHOT in apache.snapshots (http://repository.apache.org/snapshots)
        at org.apache.maven.plugin.DefaultBuildPluginManager.executeMojo(DefaultBuildPluginManager.java:82)
        at org.apache.maven.lifecycle.internal.MojoExecutor.execute(MojoExecutor.java:209)
        ... 27 more
Caused by: org.apache.maven.plugin.PluginResolutionException: Plugin org.apache.maven.plugins:maven-checkstyle-plugin:2.7 or one of its dependencies could not be resolved: Could not find artifact org.syncope:syncope-build-tools:jar:0.7-SNAPSHOT in apache.snapshots (http://repository.apache.org/snapshots)
        at org.apache.maven.plugin.internal.DefaultPluginDependenciesResolver.resolve(DefaultPluginDependenciesResolver.java:215)
        at org.apache.maven.plugin.internal.DefaultMavenPluginManager.createPluginRealm(DefaultMavenPluginManager.java:353)
        at org.apache.maven.plugin.internal.DefaultMavenPluginManager.setupPluginRealm(DefaultMavenPluginManager.java:321)
        at org.apache.maven.plugin.DefaultBuildPluginManager.getPluginRealm(DefaultBuildPluginManager.java:175)
        at org.apache.maven.plugin.DefaultBuildPluginManager.executeMojo(DefaultBuildPluginManager.java:78)
        ... 28 more
Caused by: org.sonatype.aether.resolution.ArtifactResolutionException: Could not find artifact org.syncope:syncope-build-tools:jar:0.7-SNAPSHOT in apache.snapshots (http://repository.apache.org/snapshots)
        at org.sonatype.aether.impl.internal.DefaultArtifactResolver.resolve(DefaultArtifactResolver.java:541)
        at org.sonatype.aether.impl.internal.DefaultArtifactResolver.resolveArtifacts(DefaultArtifactResolver.java:220)
        at org.sonatype.aether.impl.internal.DefaultRepositorySystem.resolveDependencies(DefaultRepositorySystem.java:395)
        at org.apache.maven.plugin.internal.DefaultPluginDependenciesResolver.resolve(DefaultPluginDependenciesResolver.java:207)
        ... 32 more
Caused by: org.sonatype.aether.transfer.ArtifactNotFoundException: Could not find artifact org.syncope:syncope-build-tools:jar:0.7-SNAPSHOT in apache.snapshots (http://repository.apache.org/snapshots)
        at org.sonatype.aether.connector.wagon.WagonRepositoryConnector$4.wrap(WagonRepositoryConnector.java:945)
        at org.sonatype.aether.connector.wagon.WagonRepositoryConnector$4.wrap(WagonRepositoryConnector.java:940)
        at org.sonatype.aether.connector.wagon.WagonRepositoryConnector$GetTask.flush(WagonRepositoryConnector.java:695)
        at org.sonatype.aether.connector.wagon.WagonRepositoryConnector$GetTask.flush(WagonRepositoryConnector.java:689)
        at org.sonatype.aether.connector.wagon.WagonRepositoryConnector.get(WagonRepositoryConnector.java:445)
        at org.sonatype.aether.impl.internal.DefaultArtifactResolver.resolve(DefaultArtifactResolver.java:460)
        ... 35 more
[CHECKSTYLE] Aggregating results of Syncope
[CHECKSTYLE] Using set difference to compute new warnings
[CHECKSTYLE] Not changing build status, since no threshold has been exceeded
[PMD] Aggregating results of Syncope
[PMD] Using set difference to compute new warnings
[PMD] Not changing build status, since no threshold has been exceeded
Sending e-mails to: [hidden email]
channel stopped

Reply | Threaded
Open this post in threaded view
|  
Report Content as Inappropriate

[syncope-dev] Build failed in Jenkins: Syncope trunk (GNU Linux) #12

jenkins
See <http://jenkins.syncope-idm.org/job/Syncope%20trunk%20(GNU%20Linux)/12/>

------------------------------------------
[...truncated 654 lines...]
A         core/src/main/java/org/syncope/core/util/ApplicationContextManager.java
A         core/src/main/java/org/syncope/core/util/ApplicationContextProvider.java
A         core/src/main/java/org/syncope/core/util/EntitlementUtil.java
A         core/src/main/java/org/syncope/core/util/EncryptionUtil.java
A         core/src/main/resources
A         core/src/main/resources/ehcache.xml
A         core/src/main/resources/persistence.properties
A         core/src/main/resources/restContext.xml
A         core/src/main/resources/syncopeContext.xml
A         core/src/main/resources/quartz
A         core/src/main/resources/quartz/tables_hsqldb.sql
A         core/src/main/resources/quartz/tables_mysql_innodb.sql
A         core/src/main/resources/quartz/tables_oracle.sql
A         core/src/main/resources/quartz/tables_mysql.sql
A         core/src/main/resources/quartz/tables_postgres.sql
A         core/src/main/resources/persistenceContext.xml
A         core/src/main/resources/schedulingContext.xml
A         core/src/main/resources/views.xml
A         core/src/main/resources/workflows.xml
A         core/src/main/resources/indexes.xml
A         core/src/main/resources/META-INF
A         core/src/main/resources/META-INF/propertyset.xml
A         core/src/main/resources/META-INF/orm.xml.oracle
A         core/src/main/resources/META-INF/services
A         core/src/main/resources/META-INF/services/org.identityconnectors.common.logging
A         core/src/main/resources/META-INF/persistence.xml
A         core/src/main/resources/META-INF/orm.xml
A         core/src/main/resources/logback.xml
A         core/src/main/resources/mailTemplates
A         core/src/main/resources/mailTemplates/optin.txt.vm
A         core/src/main/resources/mailTemplates/optin.html.vm
A         core/src/main/resources/security.properties
A         core/src/main/resources/userWorkflow.xml
A         core/src/main/resources/content.xml
A         core/src/main/resources/securityContext.xml
A         core/src/main/resources/workflowContext.xml
A         core/src/main/webapp
A         core/src/main/webapp/version.jsp
A         core/src/main/webapp/dbExport.jsp
A         core/src/main/webapp/syncopeClientError.jsp
A         core/src/main/webapp/WEB-INF
A         core/src/main/webapp/WEB-INF/sun-web.xml
A         core/src/main/webapp/WEB-INF/web.xml
A         core/src/main/webapp/hibernateStats.jsp
A         core/pom.xml
A         pom.xml
A         build-tools
A         build-tools/src
A         build-tools/src/main
A         build-tools/src/main/resources
A         build-tools/src/main/resources/org
A         build-tools/src/main/resources/org/syncope
A         build-tools/src/main/resources/org/syncope/checkstyle.xml
A         build-tools/pom.xml
A         client
A         client/src
A         client/src/test
A         client/src/test/java
A         client/src/test/java/org
A         client/src/test/java/org/syncope
A         client/src/test/java/org/syncope/client
A         client/src/test/java/org/syncope/client/test
A         client/src/test/java/org/syncope/client/test/JSONTest.java
A         client/src/test/resources
A         client/src/main
A         client/src/main/java
A         client/src/main/java/org
A         client/src/main/java/org/syncope
A         client/src/main/java/org/syncope/types
A         client/src/main/java/org/syncope/types/PropagationTaskExecStatus.java
A         client/src/main/java/org/syncope/types/SyncopeClientExceptionType.java
A         client/src/main/java/org/syncope/types/CipherAlgorithm.java
A         client/src/main/java/org/syncope/types/PolicyType.java
A         client/src/main/java/org/syncope/types/SchemaType.java
A         client/src/main/java/org/syncope/types/EntityViolationType.java
A         client/src/main/java/org/syncope/types/AbstractPolicy.java
A         client/src/main/java/org/syncope/types/ConnConfPropSchema.java
A         client/src/main/java/org/syncope/types/SyntaxPolicy.java
A         client/src/main/java/org/syncope/types/TraceLevel.java
A         client/src/main/java/org/syncope/types/ConnConfProperty.java
A         client/src/main/java/org/syncope/types/PropagationMode.java
A         client/src/main/java/org/syncope/types/ResourceOperationType.java
A         client/src/main/java/org/syncope/types/ConnectorCapability.java
A         client/src/main/java/org/syncope/types/SourceMappingType.java
A         client/src/main/java/org/syncope/client
A         client/src/main/java/org/syncope/client/mod
A         client/src/main/java/org/syncope/client/mod/SyncTaskMod.java
A         client/src/main/java/org/syncope/client/mod/RoleMod.java
A         client/src/main/java/org/syncope/client/mod/AttributeMod.java
A         client/src/main/java/org/syncope/client/mod/AbstractAttributableMod.java
A         client/src/main/java/org/syncope/client/mod/SchedTaskMod.java
A         client/src/main/java/org/syncope/client/mod/MembershipMod.java
A         client/src/main/java/org/syncope/client/mod/UserMod.java
A         client/src/main/java/org/syncope/client/to
A         client/src/main/java/org/syncope/client/to/SyncTaskTO.java
A         client/src/main/java/org/syncope/client/to/SchemaTO.java
A         client/src/main/java/org/syncope/client/to/RoleTO.java
A         client/src/main/java/org/syncope/client/to/TaskTO.java
A         client/src/main/java/org/syncope/client/to/AttributeTO.java
A         client/src/main/java/org/syncope/client/to/DerivedSchemaTO.java
A         client/src/main/java/org/syncope/client/to/PropagationTaskTO.java
A         client/src/main/java/org/syncope/client/to/AbstractAttributableTO.java
A         client/src/main/java/org/syncope/client/to/TaskExecTO.java
A         client/src/main/java/org/syncope/client/to/VirtualSchemaTO.java
A         client/src/main/java/org/syncope/client/to/ConfigurationTO.java
A         client/src/main/java/org/syncope/client/to/SchedTaskTO.java
A         client/src/main/java/org/syncope/client/to/SchemaMappingTO.java
A         client/src/main/java/org/syncope/client/to/UserTO.java
A         client/src/main/java/org/syncope/client/to/LoggerTO.java
A         client/src/main/java/org/syncope/client/to/ConnInstanceTO.java
A         client/src/main/java/org/syncope/client/to/ConnBundleTO.java
A         client/src/main/java/org/syncope/client/to/ResourceTO.java
A         client/src/main/java/org/syncope/client/to/MembershipTO.java
A         client/src/main/java/org/syncope/client/to/WorkflowActionsTO.java
A         client/src/main/java/org/syncope/client/AbstractBaseBean.java
A         client/src/main/java/org/syncope/client/search
A         client/src/main/java/org/syncope/client/search/MembershipCond.java
A         client/src/main/java/org/syncope/client/search/AttributeCond.java
A         client/src/main/java/org/syncope/client/search/NodeCond.java
A         client/src/main/java/org/syncope/client/search/ResourceCond.java
A         client/src/main/java/org/syncope/client/validation
A         client/src/main/java/org/syncope/client/validation/SyncopeClientErrorHandler.java
A         client/src/main/java/org/syncope/client/validation/SyncopeClientCompositeErrorException.java
A         client/src/main/java/org/syncope/client/validation/SyncopeClientException.java
A         client/src/main/resources
A         client/pom.xml
 U        .
At revision 1153
no change for http://syncope.googlecode.com/svn/trunk since the previous build
 your Apache Maven build is setup to use a config with id  but cannot find the config
 your Apache Maven build is setup to use a global settings config with id  but cannot find the config
Parsing POMs
[Syncope trunk (GNU Linux)] $ /usr/lib/jvm/java-6-sun/bin/java -Xms512m -Xmx1024m -XX:PermSize=256m -XX:MaxPermSize=512m -cp /var/lib/jenkins/plugins/maven-plugin/WEB-INF/lib/maven3-agent-1.2.jar:/opt/apache-maven-3.0.3/boot/plexus-classworlds-2.4.jar org.jvnet.hudson.maven3.agent.Maven3Main /opt/apache-maven-3.0.3 /var/run/jenkins/war/WEB-INF/lib/remoting-2.4.jar /var/lib/jenkins/plugins/maven-plugin/WEB-INF/lib/maven3-interceptor-1.2.jar 32941
<===[JENKINS REMOTING CAPACITY]===>   channel started
Executing Maven:  -B -f <http://jenkins.syncope-idm.org/job/Syncope%20trunk%20(GNU%20Linux)/ws/pom.xml> clean verify pmd:pmd checkstyle:checkstyle findbugs:findbugs
[INFO] Scanning for projects...
[INFO] ------------------------------------------------------------------------
[INFO] Reactor Build Order:
[INFO]
[INFO] Syncope
[INFO] Syncope build tools
[INFO] Syncope client
[INFO] Syncope core
[INFO] Syncope console
[INFO] Syncope archetype
[INFO]                                                                        
[INFO] ------------------------------------------------------------------------
[INFO] Building Syncope 0.7-SNAPSHOT
[INFO] ------------------------------------------------------------------------
[INFO]
[INFO] --- maven-clean-plugin:2.4.1:clean (default-clean) @ syncope ---
[INFO]
[INFO] --- maven-enforcer-plugin:1.0:enforce (enforce-maven) @ syncope ---
[INFO]
[INFO] --- maven-pmd-plugin:2.5:pmd (default-cli) @ syncope ---
[PMD] Using set difference to compute new warnings
[PMD] Not changing build status, since no threshold has been exceeded
[INFO]
[INFO] --- maven-checkstyle-plugin:2.7:checkstyle (default-cli) @ syncope ---
Downloading: http://repository.apache.org/snapshots/org/syncope/syncope-build-tools/0.7-SNAPSHOT/syncope-build-tools-0.7-SNAPSHOT.jar
mojoFailed org.apache.maven.plugins:maven-checkstyle-plugin:2.7(default-cli)
ignoring exception during new ExecutedMojo null
[CHECKSTYLE] Using set difference to compute new warnings
[CHECKSTYLE] Not changing build status, since no threshold has been exceeded
projectFailed org.syncope:syncope:0.7-SNAPSHOT
[JENKINS] Archiving <http://jenkins.syncope-idm.org/job/Syncope%20trunk%20(GNU%20Linux)/ws/pom.xml> to /var/lib/jenkins/jobs/Syncope trunk (GNU Linux)/modules/org.syncope$syncope/builds/2011-08-31_17-02-48/archive/org.syncope/syncope/0.7-SNAPSHOT/syncope-0.7-SNAPSHOT.pom
sessionEnded
[INFO] ------------------------------------------------------------------------
[INFO] Reactor Summary:
[INFO]
[INFO] Syncope ........................................... FAILURE [4.071s]
[INFO] Syncope build tools ............................... SKIPPED
[INFO] Syncope client .................................... SKIPPED
[INFO] Syncope core ...................................... SKIPPED
[INFO] Syncope console ................................... SKIPPED
[INFO] Syncope archetype ................................. SKIPPED
[INFO] ------------------------------------------------------------------------
[INFO] BUILD FAILURE
[INFO] ------------------------------------------------------------------------
[INFO] Total time: 5.961s
[INFO] Finished at: Wed Aug 31 17:02:57 CEST 2011
[INFO] Final Memory: 15M/490M
[INFO] ------------------------------------------------------------------------
mavenExecutionResult exceptions not empty
message : Failed to execute goal org.apache.maven.plugins:maven-checkstyle-plugin:2.7:checkstyle (default-cli) on project syncope: Execution default-cli of goal org.apache.maven.plugins:maven-checkstyle-plugin:2.7:checkstyle failed: Plugin org.apache.maven.plugins:maven-checkstyle-plugin:2.7 or one of its dependencies could not be resolved: Could not find artifact org.syncope:syncope-build-tools:jar:0.7-SNAPSHOT in apache.snapshots (http://repository.apache.org/snapshots)
cause : Execution default-cli of goal org.apache.maven.plugins:maven-checkstyle-plugin:2.7:checkstyle failed: Plugin org.apache.maven.plugins:maven-checkstyle-plugin:2.7 or one of its dependencies could not be resolved: Could not find artifact org.syncope:syncope-build-tools:jar:0.7-SNAPSHOT in apache.snapshots (http://repository.apache.org/snapshots)
Stack trace :
org.apache.maven.lifecycle.LifecycleExecutionException: Failed to execute goal org.apache.maven.plugins:maven-checkstyle-plugin:2.7:checkstyle (default-cli) on project syncope: Execution default-cli of goal org.apache.maven.plugins:maven-checkstyle-plugin:2.7:checkstyle failed: Plugin org.apache.maven.plugins:maven-checkstyle-plugin:2.7 or one of its dependencies could not be resolved: Could not find artifact org.syncope:syncope-build-tools:jar:0.7-SNAPSHOT in apache.snapshots (http://repository.apache.org/snapshots)
        at org.apache.maven.lifecycle.internal.MojoExecutor.execute(MojoExecutor.java:225)
        at org.apache.maven.lifecycle.internal.MojoExecutor.execute(MojoExecutor.java:153)
        at org.apache.maven.lifecycle.internal.MojoExecutor.execute(MojoExecutor.java:145)
        at org.apache.maven.lifecycle.internal.LifecycleModuleBuilder.buildProject(LifecycleModuleBuilder.java:84)
        at org.apache.maven.lifecycle.internal.LifecycleModuleBuilder.buildProject(LifecycleModuleBuilder.java:59)
        at org.apache.maven.lifecycle.internal.LifecycleStarter.singleThreadedBuild(LifecycleStarter.java:183)
        at org.apache.maven.lifecycle.internal.LifecycleStarter.execute(LifecycleStarter.java:161)
        at org.apache.maven.DefaultMaven.doExecute(DefaultMaven.java:319)
        at org.apache.maven.DefaultMaven.execute(DefaultMaven.java:156)
        at org.jvnet.hudson.maven3.launcher.Maven3Launcher.main(Maven3Launcher.java:79)
        at sun.reflect.NativeMethodAccessorImpl.invoke0(Native Method)
        at sun.reflect.NativeMethodAccessorImpl.invoke(NativeMethodAccessorImpl.java:39)
        at sun.reflect.DelegatingMethodAccessorImpl.invoke(DelegatingMethodAccessorImpl.java:25)
        at java.lang.reflect.Method.invoke(Method.java:597)
        at org.codehaus.plexus.classworlds.launcher.Launcher.launchStandard(Launcher.java:329)
        at org.codehaus.plexus.classworlds.launcher.Launcher.launch(Launcher.java:239)
        at org.jvnet.hudson.maven3.agent.Maven3Main.launch(Maven3Main.java:158)
        at hudson.maven.Maven3Builder.call(Maven3Builder.java:121)
        at hudson.maven.Maven3Builder.call(Maven3Builder.java:73)
        at hudson.remoting.UserRequest.perform(UserRequest.java:118)
        at hudson.remoting.UserRequest.perform(UserRequest.java:48)
        at hudson.remoting.Request$2.run(Request.java:287)
        at java.util.concurrent.Executors$RunnableAdapter.call(Executors.java:441)
        at java.util.concurrent.FutureTask$Sync.innerRun(FutureTask.java:303)
        at java.util.concurrent.FutureTask.run(FutureTask.java:138)
        at java.util.concurrent.ThreadPoolExecutor$Worker.runTask(ThreadPoolExecutor.java:886)
        at java.util.concurrent.ThreadPoolExecutor$Worker.run(ThreadPoolExecutor.java:908)
        at java.lang.Thread.run(Thread.java:662)
Caused by: org.apache.maven.plugin.PluginExecutionException: Execution default-cli of goal org.apache.maven.plugins:maven-checkstyle-plugin:2.7:checkstyle failed: Plugin org.apache.maven.plugins:maven-checkstyle-plugin:2.7 or one of its dependencies could not be resolved: Could not find artifact org.syncope:syncope-build-tools:jar:0.7-SNAPSHOT in apache.snapshots (http://repository.apache.org/snapshots)
        at org.apache.maven.plugin.DefaultBuildPluginManager.executeMojo(DefaultBuildPluginManager.java:82)
        at org.apache.maven.lifecycle.internal.MojoExecutor.execute(MojoExecutor.java:209)
        ... 27 more
Caused by: org.apache.maven.plugin.PluginResolutionException: Plugin org.apache.maven.plugins:maven-checkstyle-plugin:2.7 or one of its dependencies could not be resolved: Could not find artifact org.syncope:syncope-build-tools:jar:0.7-SNAPSHOT in apache.snapshots (http://repository.apache.org/snapshots)
        at org.apache.maven.plugin.internal.DefaultPluginDependenciesResolver.resolve(DefaultPluginDependenciesResolver.java:215)
        at org.apache.maven.plugin.internal.DefaultMavenPluginManager.createPluginRealm(DefaultMavenPluginManager.java:353)
        at org.apache.maven.plugin.internal.DefaultMavenPluginManager.setupPluginRealm(DefaultMavenPluginManager.java:321)
        at org.apache.maven.plugin.DefaultBuildPluginManager.getPluginRealm(DefaultBuildPluginManager.java:175)
        at org.apache.maven.plugin.DefaultBuildPluginManager.executeMojo(DefaultBuildPluginManager.java:78)
        ... 28 more
Caused by: org.sonatype.aether.resolution.ArtifactResolutionException: Could not find artifact org.syncope:syncope-build-tools:jar:0.7-SNAPSHOT in apache.snapshots (http://repository.apache.org/snapshots)
        at org.sonatype.aether.impl.internal.DefaultArtifactResolver.resolve(DefaultArtifactResolver.java:541)
        at org.sonatype.aether.impl.internal.DefaultArtifactResolver.resolveArtifacts(DefaultArtifactResolver.java:220)
        at org.sonatype.aether.impl.internal.DefaultRepositorySystem.resolveDependencies(DefaultRepositorySystem.java:395)
        at org.apache.maven.plugin.internal.DefaultPluginDependenciesResolver.resolve(DefaultPluginDependenciesResolver.java:207)
        ... 32 more
Caused by: org.sonatype.aether.transfer.ArtifactNotFoundException: Could not find artifact org.syncope:syncope-build-tools:jar:0.7-SNAPSHOT in apache.snapshots (http://repository.apache.org/snapshots)
        at org.sonatype.aether.connector.wagon.WagonRepositoryConnector$4.wrap(WagonRepositoryConnector.java:945)
        at org.sonatype.aether.connector.wagon.WagonRepositoryConnector$4.wrap(WagonRepositoryConnector.java:940)
        at org.sonatype.aether.connector.wagon.WagonRepositoryConnector$GetTask.flush(WagonRepositoryConnector.java:695)
        at org.sonatype.aether.connector.wagon.WagonRepositoryConnector$GetTask.flush(WagonRepositoryConnector.java:689)
        at org.sonatype.aether.connector.wagon.WagonRepositoryConnector.get(WagonRepositoryConnector.java:445)
        at org.sonatype.aether.impl.internal.DefaultArtifactResolver.resolve(DefaultArtifactResolver.java:460)
        ... 35 more
[CHECKSTYLE] Aggregating results of Syncope
[CHECKSTYLE] Using set difference to compute new warnings
[CHECKSTYLE] Not changing build status, since no threshold has been exceeded
[PMD] Aggregating results of Syncope
[PMD] Using set difference to compute new warnings
[PMD] Not changing build status, since no threshold has been exceeded
Sending e-mails to: [hidden email]
channel stopped

Reply | Threaded
Open this post in threaded view
|  
Report Content as Inappropriate

[syncope-dev] Jenkins build is back to normal : Syncope trunk (GNU Linux) #13

jenkins
Loading...